program: Gaussian 09
title: 000221822
version: EM64L-G09RevD.01
frameworkgroup: C1[X(C13H8ClNO4)]
method: RPBEPBE
basis: SDD
operation: Freq
keyword: #p
keyword: freq=noraman
keyword: PBEPBE/SDD
title: #p freq=noraman PBEPBE/SDD
converged: YES YES NO NO
title: Mulliken charges:
elementType: Cl O O O O N C C C C C C C C C C C C C H H H H H H H H
charge: -0.030662 -0.298918 -0.220956 -0.198739 -0.198250 0.028254 0.234267 -0.310573 -0.302961 0.388471 -0.353975 -0.342475 0.533400 0.166524 -0.346086 -0.297652 -0.207571 -0.217839 -0.231690 0.280085 0.293851 0.292636 0.291915 0.308702 0.260976 0.239028 0.240237
chargesum: 0.00000
title: Mulliken charges with hydrogens summed into heavy atoms:
elementType: Cl O O O O N C C C C C C C C C C C C C
charge: -0.030662 -0.298918 -0.220956 -0.198739 -0.198250 0.028254 0.234267 -0.030488 -0.009109 0.388471 -0.061339 -0.050560 0.533400 0.166524 -0.346086 0.011050 0.053406 0.021189 0.008548
polarizability: 3.08671475e+02 1.19504950e+01 1.89108288e+02 -7.94448803e-02 1.29141927e-01 6.24127740e+01
1716.lowfreq: -6.4809 -4.3867 -0.0023 0.0004 0.0006 5.2266 17.2505 30.3746 52.0789
frequency: 17.1570 30.3551 52.0740 55.6926 74.6967 87.1556 146.4091 152.8991 190.5589 225.7744 239.9119 286.7101 291.3739 359.0612 382.9888 409.6876 430.4801 439.2995 456.7652 493.1759 525.0973 536.5547 576.9083 623.3514 647.9759 662.9787 681.5354 691.5504 713.4027 759.1154 763.9365 764.3336 783.8807 833.1372 865.4643 869.7070 890.1979 952.6717 990.7511 1001.9550 1007.7389 1012.7453 1017.6075 1025.5138 1051.3069 1088.7516 1110.8008 1129.9858 1170.8582 1178.0839 1200.2480 1214.6125 1234.6911 1263.0045 1294.7824 1368.8645 1373.5708 1406.2427 1414.8070 1427.8233 1457.1397 1474.4408 1573.5080 1590.7394 1598.3443 1609.6141 1630.4188 3146.5142 3162.3821 3164.9925 3174.0926 3178.2756 3188.4803 3192.1459 3208.0321
redmass: 7.5724 7.2432 10.4747 10.0570 5.9151 7.8214 12.1981 6.0985 8.0106 10.5145 6.6815 6.3663 9.2450 9.8832 7.0237 2.8857 9.5702 3.3278 4.1753 9.3246 6.7269 3.9483 7.9939 7.1275 6.3650 7.1334 3.9427 8.7363 4.4368 9.6980 1.6656 2.3891 8.9404 7.5148 1.2392 1.3445 1.6630 1.3578 1.3160 3.9859 1.3434 1.3729 7.0995 3.1966 2.5450 3.3104 1.3037 1.5750 1.1785 1.2337 3.2682 5.0262 4.8797 1.4511 1.2644 7.7859 10.1870 8.9678 4.2267 2.2377 2.5032 2.4087 6.4708 8.5610 7.2125 6.3808 11.0594 1.0867 1.0924 1.0902 1.0900 1.0988 1.0958 1.0975 1.0948
irintensity: 0.5652 0.0004 0.1284 0.3816 0.1332 6.1219 4.6530 1.0740 0.0657 3.9739 0.0140 0.2664 3.9597 9.1618 0.5703 0.0004 3.2483 7.1399 2.6858 4.8500 4.2269 0.1357 4.0577 0.4480 0.1802 15.8410 54.0999 3.1063 0.3420 12.2810 84.7321 21.8891 37.1927 9.3505 0.0053 1.6112 58.5292 5.2036 1.2830 84.1395 0.2821 0.0260 37.1780 63.0031 238.2911 15.2999 10.9573 5.1526 45.3020 5.4120 624.4942 248.5932 79.6023 5.5371 3.8879 81.6274 14.1388 6.3111 68.3580 16.8593 117.8626 3.5538 9.2393 25.1823 0.4136 2.6175 145.8904 2.3563 10.7250 0.9962 3.2736 11.6080 1.2674 0.4051 6.5661
temp: 298.150 k
press: 1.00000 atm
elementType: 17 8 8 8 8 7 6 6 6 6 6 6 6 6 6 6 6 6 6 1 1 1 1 1 1 1 1
symmnumber: 1
zpe: 480288.0 jmol-1
zpe.correction: 0.182932 hartree
zpe.thermalcorrener: 0.198984 hartree
zpe.thermalcorrenthalpy: 0.199928 hartree
zpe.thermalcorrgfe: 0.136242 hartree
zpe.sumelectzpe: -1314.484420 hartree
zpe.sumelectthermal: -1314.468368 hartree
zpe.sumelectthermalent: -1314.467424 hartree
zpe.sumelectthermalfe: -1314.531110 hartree
dipole: -5.5704 -1.1100 0.0053
dipole: 5.6799
quadrupole: -125.5486 -114.6227 -117.4992
quadrupole: -5.6689 0.0078 0.0072
quadrupole: -6.3251 4.6008 1.7243 -5.6689 0.0078 0.0072
hfenergy: -1314.6673523 hartree
pointgroup: C01 [X(C13H8Cl1N1O4)]
dipole: -2.1972373 0.4013214 0.0692507 debye
polarizability: 308.6761413|-10.2021462|188.5851056|-9.2427992|-4.2648119|62.9312902 unknown
InChI: InChI=1S/C13H8ClNO4/c14-11-3-1-2-4-12(11)19-13(16)9-5-7-10(8-6-9)15(17)18/h1-8H
charge 0 multiplicity 1
27 atoms
Cl -2.406321 -2.686467 0.261804
O  -1.323253 0.027088 0.107416
O  -0.793173 2.323072 0.003939
O  5.974425 0.340261 -0.181839
O  5.326931 -1.844936 -0.083366
N  5.072875 -0.580494 -0.116646
C  0.969447 0.63732 -0.004122
C  1.996436 1.615427 -0.075424
C  1.296058 -0.744509 0.029883
C  3.646266 -0.155889 -0.07757
C  3.346094 1.223846 -0.112618
C  2.643745 -1.147761 -0.007031
C  -2.735911 0.099182 0.1623
C  -0.44289 1.122812 0.033361
C  -3.388066 -1.157399 0.2393
C  -3.506323 1.287627 0.145866
C  -4.789316 -1.244032 0.299661
C  -4.914566 1.197286 0.206912
C  -5.558152 -0.057234 0.283283
H  1.716045 2.6729 -0.100499
H  0.493833 -1.484454 0.084771
H  4.159176 1.951816 -0.167173
H  2.930464 -2.201988 0.01756
H  -3.004846 2.253884 0.086599
H  -5.268307 -2.225533 0.358699
H  -5.505749 2.118492 0.194052
H  -6.649721 -0.120616 0.330082
