program: Gaussian 09
title: 000221815
version: EM64L-G09RevD.01
frameworkgroup: C1[X(C12H17NO4)]
method: RPBEPBE
basis: SDD
operation: Freq
keyword: #p
keyword: freq=noraman
keyword: PBEPBE/SDD
title: #p freq=noraman PBEPBE/SDD
converged: NO YES NO NO
title: Mulliken charges:
elementType: O O O O N C C C C C C C C C C C C H H H H H H H H H H H H H H H H H
charge: -0.320451 -0.315513 -0.272021 -0.290667 -0.441288 0.049970 0.292662 0.185617 -0.683025 -0.687006 -0.325342 -0.467809 0.334320 -0.365742 0.250149 -0.526854 -0.536197 0.232259 0.208865 0.254597 0.216928 0.206613 0.232273 0.220785 0.299874 0.360186 0.263254 0.241381 0.227794 0.227578 0.242712 0.241609 0.221278 0.221210
chargesum: 0.00000
title: Mulliken charges with hydrogens summed into heavy atoms:
elementType: O O O O N C C C C C C C C C C C C
charge: -0.320451 -0.315513 -0.272021 -0.290667 -0.081102 0.282229 0.292662 0.185617 -0.002635 -0.027334 -0.025467 -0.204555 0.334320 -0.124361 0.250149 0.171230 0.147900
polarizability: 2.41121126e+02 -8.62113237e+00 1.62918582e+02 1.21043132e+00 1.59171915e+00 8.97618344e+01
1716.lowfreq: -9.3085 -2.0053 -0.0011 -0.0009 -0.0009 5.5195 25.4771 38.1281 68.8907
frequency: 25.3162 38.0920 68.8886 73.7541 79.8932 94.0180 101.3053 159.6913 171.4258 176.5502 194.4733 198.2015 233.4308 238.1297 241.9218 266.3980 270.2749 302.2035 359.4552 382.4442 391.2995 414.3823 449.5657 452.6876 506.8343 538.8773 570.0791 613.5282 683.3712 687.0795 714.4633 719.4302 736.8575 762.7751 806.9029 840.3131 852.6366 880.4369 901.2767 924.2775 941.1723 952.6641 983.6715 996.3200 1018.4961 1105.6101 1112.7541 1117.6654 1118.8506 1141.4602 1155.1708 1157.8902 1169.2526 1177.4729 1187.5639 1215.4126 1267.8363 1304.7537 1321.4897 1339.6707 1378.3322 1393.3133 1394.5865 1423.7775 1434.2762 1452.7823 1456.9025 1464.1286 1464.4158 1465.0712 1468.1195 1472.7206 1476.8783 1485.8770 1487.7839 1524.7435 1603.0686 1630.0424 1647.6348 2957.9823 2967.3111 2987.8885 2992.4611 3024.7424 3044.3970 3057.4514 3082.7728 3092.9355 3098.9232 3104.7155 3122.6570 3128.0483 3165.5747 3180.3895 3188.3455 3521.6460
redmass: 3.0873 3.6136 4.1149 3.7406 5.3031 3.9249 4.1771 3.5509 3.6222 3.4519 1.0403 1.4609 4.0133 1.1715 1.2211 2.2040 3.7010 4.6668 3.2807 4.8319 4.1322 3.6652 2.7119 3.2290 6.6108 5.0736 4.3627 3.7745 4.4102 6.6281 5.7286 2.2739 1.6484 4.2624 1.4005 1.6734 4.0463 6.2363 2.9364 1.2345 1.3636 1.3054 8.0484 8.9359 3.3041 1.8170 1.2601 1.2812 2.1669 1.5096 2.0439 1.4801 2.3252 1.7327 2.0146 1.9558 2.0438 2.1871 1.4647 1.2845 1.2612 3.5432 1.3206 2.1752 1.1924 1.6432 1.0570 1.0638 1.0505 1.0525 1.3153 1.0555 1.0749 1.3021 1.1971 3.1414 6.0246 7.0690 9.3698 1.0328 1.0324 1.0356 1.0357 1.0864 1.1037 1.1043 1.0993 1.0987 1.1005 1.1006 1.0994 1.1003 1.0888 1.0911 1.0953 1.0758
irintensity: 0.5684 2.2610 1.2556 1.6467 1.2725 13.9852 0.7632 3.3118 4.2508 2.7715 0.1880 1.2348 2.1137 0.1810 0.0597 1.3386 4.2439 6.5110 1.7971 2.5801 9.1446 6.7902 3.6872 6.2649 4.2786 22.3444 3.2471 9.2417 0.1772 18.4165 5.7254 19.9325 79.0435 8.7188 34.8198 58.6183 1.6270 0.3205 2.0687 3.0981 0.9765 6.0450 359.5276 13.6968 64.4845 222.0373 0.1480 7.1741 158.1739 20.5269 34.5672 81.0463 268.7118 140.5845 48.2186 5.9696 109.3035 39.8084 7.8551 11.9943 33.8636 56.7931 19.3537 43.3408 12.2255 46.8409 6.7751 21.0649 11.1695 16.7847 93.4623 1.4169 21.5562 59.5195 74.0709 775.2558 32.8675 42.6945 267.2466 75.2310 62.0623 17.4321 29.3535 7.4072 49.9190 42.6980 7.8301 62.1510 22.5100 30.6787 27.2569 19.6620 9.2528 2.3278 5.5430 71.1544
temp: 298.150 k
press: 1.00000 atm
elementType: 8 8 8 8 7 6 6 6 6 6 6 6 6 6 6 6 6 1 1 1 1 1 1 1 1 1 1 1 1 1 1 1 1 1
symmnumber: 1
zpe: 722250.3 jmol-1
zpe.correction: 0.275091 hartree
zpe.thermalcorrener: 0.293469 hartree
zpe.thermalcorrenthalpy: 0.294413 hartree
zpe.thermalcorrgfe: 0.227755 hartree
zpe.sumelectzpe: -821.820099 hartree
zpe.sumelectthermal: -821.801721 hartree
zpe.sumelectthermalent: -821.800777 hartree
zpe.sumelectthermalfe: -821.867435 hartree
dipole: 0.9587 1.8497 0.2453
dipole: 2.0978
quadrupole: -81.3584 -88.2061 -103.5591
quadrupole: -4.7400 -0.1972 0.4513
quadrupole: 9.6828 2.8351 -12.5179 -4.7400 -0.1972 0.4513
hfenergy: -822.0951898 hartree
pointgroup: C01[X(C12H17N1O4)]
dipole: 0.3511129 0.7391859 0.1073108 debye
polarizability: 241.6574094|-5.6900556|162.2957542|-0.5533753|3.1130008|89.8483789 unknown
InChI: InChI=1S/C12H17NO4/c1-8(2)17-12(14)13-10-6-5-9(15-3)7-11(10)16-4/h5-8,13H,1-4H3
charge 0 multiplicity 1
34 atoms
O  -3.289045 0.150637 0.098506
O  0.570084 2.400116 0.333235
O  4.570299 -0.371456 0.166482
O  -2.004101 -1.829919 -0.026551
N  -1.038516 0.324041 0.163061
C  -4.547927 -0.669415 0.063194
C  0.34875 0.034051 0.153737
C  1.229834 1.157725 0.246402
C  -4.856233 -1.179973 1.478671
C  -5.618626 0.264112 -0.507555
C  0.906852 -1.257449 0.063815
C  2.622447 0.98908 0.247786
C  3.163577 -0.318971 0.156164
C  2.310377 -1.440565 0.06456
C  -2.080755 -0.575187 0.072117
C  1.395657 3.604539 0.427362
C  5.187473 -1.695214 0.074921
H  -4.358497 -1.525058 -0.611665
H  -5.799721 -1.756439 1.475314
H  -4.049114 -1.840467 1.836724
H  -4.9684 -0.332803 2.178677
H  -6.579726 -0.274449 -0.59325
H  -5.328907 0.626433 -1.5085
H  -5.765871 1.137584 0.151942
H  0.23397 -2.114606 -0.007855
H  -1.284886 1.315417 0.235586
H  3.313698 1.83233 0.317298
H  2.709408 -2.455742 -0.006521
H  2.03699 3.716512 -0.467651
H  2.025891 3.583489 1.336934
H  0.684183 4.441235 0.484655
H  6.271596 -1.510218 0.097966
H  4.914807 -2.202546 -0.871192
H  4.899132 -2.334624 0.93223
