program: Gaussian 09
title: 000221814
version: EM64L-G09RevD.01
frameworkgroup: C1[X(C12H17NO2)]
method: RPBEPBE
basis: SDD
operation: Freq
keyword: #p
keyword: freq=noraman
keyword: PBEPBE/SDD
title: #p freq=noraman PBEPBE/SDD
converged: YES YES NO NO
title: Mulliken charges:
elementType: O O N C C C C C C C C C C C C H H H H H H H H H H H H H H H H H
charge: -0.265180 -0.256266 -0.451720 -0.542085 -0.334449 0.482278 0.201181 -0.687811 -0.463098 -0.328963 0.342210 -0.331168 -0.370947 -0.243494 -0.685040 0.225945 0.226414 0.222544 0.221959 0.304667 0.204822 0.223796 0.204939 0.215017 0.309585 0.244130 0.249396 0.205127 0.205372 0.205593 0.232636 0.232610
chargesum: 0.00000
title: Mulliken charges with hydrogens summed into heavy atoms:
elementType: O O N C C C C C C C C C C C C
charge: -0.265180 -0.256266 -0.147053 -0.089726 0.110055 0.482278 0.201181 -0.054254 -0.248081 -0.019377 0.342210 -0.087039 -0.121551 0.167006 -0.014202
polarizability: 2.47009984e+02 -3.23406227e+00 1.35250580e+02 -4.67760154e-02 6.14995645e-03 8.22997856e+01
1716.lowfreq: -40.9963 -5.8701 -1.5995 -0.0005 0.0005 0.0010 12.7038 27.7735 49.2406
frequency: -40.0538 27.5882 49.2370 69.3038 69.4643 99.6067 114.6164 135.1834 184.0111 194.0798 225.0953 246.4418 247.6335 321.2949 344.3987 368.8513 376.2434 415.0043 429.8721 518.8789 563.2476 563.9663 625.3436 634.3842 701.7617 721.6794 739.6015 747.2077 795.7575 823.4999 828.7031 852.8660 872.9957 898.0571 902.7495 916.3643 947.3952 987.7767 999.3114 1038.1791 1053.6687 1091.9955 1111.2921 1115.8062 1123.2496 1135.0991 1169.3946 1181.4139 1216.3131 1223.2092 1258.4117 1267.0883 1281.4761 1291.0871 1305.4072 1351.9353 1359.0503 1374.3615 1391.1644 1399.4138 1421.2106 1444.5271 1461.0064 1470.4220 1476.4984 1478.0484 1484.7205 1487.2114 1497.8931 1506.7714 1590.2210 1626.2944 1629.6228 2947.3354 2957.0089 2971.1167 2996.6404 3004.3796 3005.2641 3010.6993 3048.2754 3074.9735 3079.7302 3093.7885 3106.1369 3110.7615 3160.5083 3163.1070 3195.9340 3518.3705
redmass: 1.8035 3.8602 4.0486 3.6646 3.8278 3.2813 1.8339 3.7156 4.7907 4.7036 1.0781 3.8083 1.1800 5.4053 3.7540 5.4027 3.9984 3.0541 4.1385 2.4074 4.9703 2.9398 6.8065 1.1811 5.1896 3.5891 1.1725 4.3602 1.3629 4.7565 1.1118 1.4816 1.3515 2.4331 3.2759 1.3890 3.3979 1.3055 2.7277 2.8374 2.4431 1.5178 2.4309 2.0410 1.3575 1.4336 2.4965 1.2921 2.3515 1.3302 1.1465 2.4140 1.4813 1.0871 1.4233 1.8279 1.6163 2.6493 1.2178 1.2833 4.0570 1.1061 1.0402 1.0581 1.0916 1.0427 1.0777 1.1635 1.8624 2.4251 6.3064 4.8123 6.3691 1.0551 1.0589 1.0362 1.0362 1.1074 1.0992 1.0613 1.1000 1.0984 1.1029 1.0988 1.1013 1.0894 1.0908 1.0934 1.0954 1.0761
irintensity: 0.3378 0.4520 0.1691 3.6248 1.7321 0.5337 4.0260 0.1004 0.5890 6.0989 0.0148 6.3258 0.7800 8.3207 0.5292 2.2639 0.4052 0.0053 0.7820 28.5712 13.7177 4.6199 0.3773 55.4574 0.9803 0.1773 13.5252 8.3320 49.4659 1.8908 0.0764 63.7841 0.5400 27.7040 43.5666 2.3467 0.6070 2.1932 3.0110 81.6840 6.9087 0.9854 2.3308 4.2549 23.2339 4.4202 172.0709 39.0282 274.3247 0.1269 0.0443 7.0482 11.3466 0.0819 11.0320 12.7439 5.2673 156.2956 8.1157 56.8537 10.1500 11.9806 11.7499 11.1803 61.3613 12.9493 16.8629 52.8587 17.3479 519.2429 61.3692 127.8996 4.8528 45.4689 17.9375 43.5650 28.7277 39.7137 14.6482 16.1054 3.8228 50.0773 75.7361 30.2242 34.7415 23.9377 6.2770 12.9498 6.6884 10.1038
temp: 298.150 k
press: 1.00000 atm
elementType: 8 8 7 6 6 6 6 6 6 6 6 6 6 6 6 1 1 1 1 1 1 1 1 1 1 1 1 1 1 1 1 1
symmnumber: 1
zpe: 701711.3 jmol-1
zpe.correction: 0.267268 hartree
zpe.thermalcorrener: 0.282503 hartree
zpe.thermalcorrenthalpy: 0.283447 hartree
zpe.thermalcorrgfe: 0.223726 hartree
zpe.sumelectzpe: -671.544022 hartree
zpe.sumelectthermal: -671.528787 hartree
zpe.sumelectthermalent: -671.527843 hartree
zpe.sumelectthermalfe: -671.587564 hartree
dipole: 0.9188 -4.9326 0.0045
dipole: 5.0175
quadrupole: -73.2596 -87.5520 -93.2032
quadrupole: 2.1547 0.0087 0.0028
quadrupole: 11.4120 -2.8804 -8.5316 2.1547 0.0087 0.0028
hfenergy: -671.8112898 hartree
pointgroup: C01 [X(C12H17N1O2)]
dipole: -0.3794717 -1.9362798 0.0597664 debye
polarizability: 246.9877412|2.3125108|135.1345918|3.384372|-1.857024|82.4380171 unknown
InChI: InChI=1S/C12H17NO2/c1-3-5-12(14)13-10-6-8-11(9-7-10)15-4-2/h6-9,13H,3-5H2,1-2H3
charge 0 multiplicity 1
32 atoms
O  -3.953851 0.601114 -0.225164
O  2.611876 1.437736 -0.118305
N  1.57118 -0.666257 -0.06302
C  4.024228 -0.586572 -0.018376
C  5.244302 0.355067 -0.020297
C  0.186509 -0.322995 -0.103316
C  2.686511 0.173859 -0.071315
C  6.576931 -0.420675 0.029831
C  -0.75764 -1.379841 -0.084423
C  -0.280924 1.020404 -0.16103
C  -2.602657 0.217557 -0.181182
C  -2.144327 -1.121981 -0.122504
C  -1.6622 1.276939 -0.199239
C  -4.969915 -0.467865 -0.210413
C  -6.332946 0.216249 -0.274612
H  4.045252 -1.223852 0.890641
H  4.084035 -1.277716 -0.885384
H  5.205009 0.993694 -0.921558
H  5.168735 1.044469 0.84039
H  1.769538 -1.669271 -0.022773
H  6.64743 -1.042823 0.942539
H  7.437899 0.27199 0.02949
H  6.686179 -1.091704 -0.84359
H  -0.411756 -2.421143 -0.039463
H  0.442401 1.837144 -0.174948
H  -2.842759 -1.963319 -0.10585
H  -2.03497 2.30487 -0.244149
H  -4.815212 -1.137988 -1.081864
H  -4.864051 -1.066621 0.718367
H  -7.139194 -0.539804 -0.266609
H  -6.472482 0.886778 0.590293
H  -6.423634 0.815959 -1.196162
