program: Gaussian 09
title: 000221811
version: EM64L-G09RevD.01
frameworkgroup: C1[X(C12H7BrN2O5)]
method: RPBEPBE
basis: SDD
operation: Freq
keyword: #p
keyword: freq=noraman
keyword: PBEPBE/SDD
title: #p freq=noraman PBEPBE/SDD
converged: YES YES NO NO
title: Mulliken charges:
elementType: Br O O O O O N N C C C C C C C C C C C C H H H H H H H
charge: 0.042480 -0.247773 -0.188391 -0.162991 -0.200600 -0.193658 0.010549 0.021087 0.218440 0.289151 0.430294 -0.475286 -0.274703 -0.379181 0.342590 -0.345158 -0.355072 -0.145084 -0.139982 -0.238293 0.333669 0.286818 0.296443 0.274793 0.276843 0.261130 0.261885
chargesum: 0.00000
title: Mulliken charges with hydrogens summed into heavy atoms:
elementType: Br O O O O O N N C C C C C C C C C C C C
charge: 0.042480 -0.247773 -0.188391 -0.162991 -0.200600 -0.193658 0.010549 0.021087 0.218440 0.289151 0.430294 -0.141618 0.012115 -0.082737 0.342590 -0.070365 -0.078228 0.116046 0.121902 -0.238293
polarizability: 3.18643366e+02 -2.64527022e+00 1.74971832e+02 1.60522670e+01 -8.37555482e+00 1.04110209e+02
1716.lowfreq: -0.0007 -0.0003 0.0002 0.6610 2.5832 5.9791 20.0073 29.0147 38.1237
frequency: 19.7741 28.9991 38.1216 42.0103 57.0900 94.6587 113.2560 131.7639 153.4285 171.5911 204.5100 265.8214 288.6525 301.1922 325.5537 353.1175 369.3192 403.6080 411.1498 437.6616 489.8703 500.1231 516.0518 566.4082 614.5248 623.0816 634.4225 652.4268 678.1600 704.6242 711.8099 737.5052 748.6293 757.7054 820.5940 830.6866 836.4183 848.7671 887.6785 952.6058 954.1395 966.5978 991.5092 993.9872 1054.1364 1056.2303 1103.7282 1113.3161 1145.9044 1151.6086 1181.6766 1202.7081 1216.6293 1241.6080 1257.3537 1286.2008 1358.9726 1365.0291 1375.3128 1390.2365 1401.7743 1428.4347 1459.2335 1467.6533 1581.3255 1584.3835 1593.9439 1609.7981 3156.4806 3167.3987 3170.1672 3178.2044 3185.6143 3188.0975 3189.8484
redmass: 7.0664 9.3075 5.7282 15.2487 15.1592 7.8488 8.8270 16.3586 5.7365 12.4643 8.3437 8.7660 8.0849 8.1328 12.2111 8.5746 7.2739 5.3788 2.9718 4.7442 5.2638 3.5215 5.3645 6.6931 6.8045 7.4099 7.2588 8.0578 7.7851 4.3399 6.3278 5.9986 5.6189 9.9445 1.3512 3.7348 1.6789 1.4924 7.7008 1.3299 1.4648 1.3597 1.3427 4.7733 2.4560 2.3495 1.3325 4.2472 1.4668 2.1120 1.3374 10.3792 8.3062 3.4291 1.6898 1.2415 6.2159 7.1949 11.8279 3.5754 8.9078 6.4851 2.3483 2.7444 6.6552 8.6019 7.9976 7.1875 1.0897 1.0894 1.0890 1.0969 1.0981 1.0932 1.0960
irintensity: 1.1747 0.9812 0.2566 0.6762 0.1978 2.7380 0.4949 1.3771 1.3512 3.5701 1.7067 0.7937 0.6236 1.7854 3.4333 1.7211 2.2184 2.9286 0.0552 4.0500 8.7882 28.0756 1.8548 4.1993 0.6309 20.4371 6.6593 11.4180 20.2663 4.2528 9.5601 6.8114 7.5082 25.7136 8.5030 9.7054 60.1031 22.7997 36.5822 0.7923 26.4174 0.3088 0.9760 125.0018 75.7463 23.9130 9.8917 8.8864 2.8335 132.5427 57.2419 325.1630 387.6191 346.7550 11.1241 0.1773 59.2098 33.1135 71.9096 6.6068 43.6806 24.5724 364.6538 36.7361 16.7114 24.9507 28.4839 182.3672 4.0802 1.9928 0.4861 1.1480 0.1505 14.3000 9.0485
temp: 298.150 k
press: 1.00000 atm
elementType: 35 8 8 8 8 8 7 7 6 6 6 6 6 6 6 6 6 6 6 6 1 1 1 1 1 1 1
symmnumber: 1
zpe: 455134.9 jmol-1
zpe.correction: 0.173352 hartree
zpe.thermalcorrener: 0.190605 hartree
zpe.thermalcorrenthalpy: 0.191549 hartree
zpe.thermalcorrgfe: 0.124063 hartree
zpe.sumelectzpe: -958.962854 hartree
zpe.sumelectthermal: -958.945601 hartree
zpe.sumelectthermalent: -958.944657 hartree
zpe.sumelectthermalfe: -959.012143 hartree
dipole: -5.5572 -2.0407 -0.7464
dipole: 5.9669
quadrupole: -158.1919 -144.2445 -116.5149
quadrupole: 2.8497 -1.5121 -4.8140
quadrupole: -18.5415 -4.5941 23.1355 2.8497 -1.5121 -4.8140
hfenergy: -959.1362061 hartree
pointgroup: C01 [X(C12H7Br1N2O5)]
dipole: 2.0152475 1.1930851 -0.1625911 debye
polarizability: 315.8009741|23.2786462|177.602964|-9.7965495|10.6194418|104.3214689 unknown
InChI: InChI=1S/C12H7BrN2O5/c13-8-1-4-10(5-2-8)20-12-6-3-9(14(16)17)7-11(12)15(18)19/h1-7H
charge 0 multiplicity 1
27 atoms
Br 6.304364 1.901737 0.393721
O  0.901213 -1.010177 -0.25796
O  -2.338846 -3.285234 0.650273
O  -0.484375 -3.287199 -0.683227
O  -4.343038 2.650825 -0.203395
O  -5.275448 0.573984 -0.01342
N  -1.423102 -2.68827 -0.040262
N  -4.261685 1.363929 -0.124264
C  -0.337437 -0.388518 -0.236434
C  -1.502384 -1.207594 -0.11533
C  -2.911481 0.758578 -0.163989
C  -2.785868 -0.637206 -0.058907
C  -0.503019 1.019589 -0.333457
C  -1.78089 1.594965 -0.307987
C  2.106242 -0.250642 -0.108312
C  2.373333 0.460446 1.080463
C  3.057358 -0.35925 -1.139978
C  3.622463 1.10273 1.227279
C  4.307888 0.281458 -0.991615
C  4.573609 1.010251 0.187545
H  -3.667589 -1.271612 0.063465
H  0.380065 1.655079 -0.438959
H  -1.92188 2.675218 -0.396549
H  1.63405 0.501296 1.886437
H  2.82429 -0.944002 -2.033908
H  3.850482 1.655591 2.142542
H  5.059283 0.208529 -1.782269
