program: Gaussian 09
title: 000221808
version: EM64L-G09RevD.01
frameworkgroup: C1[X(C11H15NO)]
method: RPBEPBE
basis: SDD
operation: Freq
keyword: #p
keyword: freq=noraman
keyword: PBEPBE/SDD
title: #p freq=noraman PBEPBE/SDD
converged: YES YES NO NO
title: Mulliken charges:
elementType: O N C C C C C C C C C C C H H H H H H H H H H H H H H H
charge: -0.285608 -0.402997 -0.022130 -0.353509 -0.695430 -0.681122 0.167639 0.266911 -0.355162 -0.358374 -0.222354 -0.236619 -0.228287 0.246951 0.182277 0.200724 0.289670 0.236384 0.195257 0.217327 0.222791 0.221590 0.212366 0.275757 0.214739 0.231564 0.228096 0.231547
chargesum: 0.00000
title: Mulliken charges with hydrogens summed into heavy atoms:
elementType: O N C C C C C C C C C C C
charge: -0.285608 -0.113327 0.224821 0.029492 -0.046462 -0.024375 0.167639 0.266911 -0.079405 -0.143634 0.009210 -0.008523 0.003260
polarizability: 1.73844634e+02 -6.27505140e+00 1.20245885e+02 8.49991288e+00 1.57648664e+01 8.87762731e+01
1716.lowfreq: -23.4729 -11.9455 -4.9505 0.0006 0.0006 0.0009 6.4024 39.9368 46.8250
frequency: -13.2138 39.5953 46.7727 91.5761 106.3870 165.1051 199.3366 207.3888 210.4084 271.4384 310.0611 366.0521 402.3098 420.6603 422.7212 477.2703 503.9937 560.7116 614.6116 655.2330 684.6208 702.2147 771.0612 790.9361 804.2174 853.0055 857.4335 910.8133 934.4038 970.7141 982.6570 989.4837 999.5040 1004.5563 1025.1737 1041.0591 1081.2750 1111.2149 1117.6324 1157.9372 1169.3479 1172.6524 1189.5851 1244.1090 1273.1936 1298.3703 1315.3860 1341.8381 1342.3719 1384.1835 1386.2301 1392.9620 1431.7464 1456.5577 1465.1498 1471.8022 1473.7707 1477.1778 1483.8994 1496.3347 1570.6810 1604.2462 1610.8958 2959.6471 2974.9763 2984.7818 3018.8619 3036.2730 3071.0220 3081.1122 3084.0057 3091.7803 3116.6383 3130.7666 3143.9790 3157.5459 3169.1691 3539.7445
redmass: 3.5017 3.9976 4.4111 1.6438 4.0111 3.2272 2.3287 1.4857 1.1480 3.5741 3.6420 3.5583 2.8083 3.0319 3.2341 2.3961 3.5388 1.4062 6.2993 6.5130 4.9260 1.5298 1.3408 2.2285 2.9467 1.5061 1.8456 2.0164 1.4580 1.2494 1.4061 5.3864 1.5115 1.3512 2.3596 3.2228 1.5714 2.4924 2.3642 2.2757 2.2581 1.0608 1.1343 1.4820 1.6925 1.2562 1.3321 1.5209 1.3781 9.0852 1.2168 1.2139 2.2048 1.2761 1.2187 1.0458 1.0529 1.4094 1.0618 1.8892 6.5910 6.7434 6.1278 1.0629 1.0376 1.0361 1.0929 1.0894 1.0975 1.0999 1.0999 1.0999 1.0869 1.0871 1.0921 1.0958 1.1004 1.0767
irintensity: 1.0981 1.8447 5.0674 0.3423 0.9942 1.1121 3.3150 1.4859 0.4924 9.5087 1.9439 1.2164 0.2180 5.7318 2.0063 7.0062 4.1913 95.0117 0.8217 12.9654 11.7066 91.6818 13.2016 24.0754 2.7920 0.2501 1.6104 3.1042 3.7581 11.7185 1.2201 1.3524 11.6266 1.4462 9.4662 1.5336 15.8084 5.5200 9.2556 13.1229 38.3375 0.9879 8.4447 14.3429 100.0956 7.8586 2.1148 2.5027 40.0692 1.4929 15.1179 14.5404 5.0234 109.4676 65.4634 3.2245 21.2092 7.5575 11.4840 142.7373 97.2665 59.1116 3.4646 37.9306 38.6321 24.0532 15.2105 8.3692 35.4419 42.8155 59.2805 39.0750 10.8566 2.2213 24.8127 17.3495 19.9685 9.3213
temp: 298.150 k
press: 1.00000 atm
elementType: 8 7 6 6 6 6 6 6 6 6 6 6 6 1 1 1 1 1 1 1 1 1 1 1 1 1 1 1
symmnumber: 1
zpe: 618914.0 jmol-1
zpe.correction: 0.235732 hartree
zpe.thermalcorrener: 0.248287 hartree
zpe.thermalcorrenthalpy: 0.249231 hartree
zpe.thermalcorrgfe: 0.196172 hartree
zpe.sumelectzpe: -557.188525 hartree
zpe.sumelectthermal: -557.175970 hartree
zpe.sumelectthermalent: -557.175026 hartree
zpe.sumelectthermalfe: -557.228085 hartree
dipole: -0.0306 2.6235 2.7375
dipole: 3.7918
quadrupole: -65.0653 -76.3705 -84.2757
quadrupole: -2.5107 0.5382 0.1399
quadrupole: 10.1719 -1.1333 -9.0386 -2.5107 0.5382 0.1399
hfenergy: -557.4242569 hartree
pointgroup: C01 [X(C11H15N1O1)]
dipole: -0.0214166 -1.1741067 0.9200772 debye
polarizability: 173.4169898|-9.3207191|92.4829481|-7.9632718|-18.3602271|116.9668543 unknown
InChI: InChI=1S/C11H15NO/c1-3-9(2)12-11(13)10-7-5-4-6-8-10/h4-9,12H,3H2,1-2H3
charge 0 multiplicity 1
28 atoms
O  -0.591942 1.549601 -1.092292
N  -1.2852 -0.0796 0.423015
C  -2.721595 0.267814 0.362801
C  -3.551845 -0.897931 -0.239002
C  -3.233595 0.677248 1.762507
C  -3.157044 -1.250717 -1.687715
C  -0.310625 0.597461 -0.294232
C  1.112789 0.13213 -0.093575
C  2.052284 0.457123 -1.104971
C  1.551261 -0.57832 1.055133
C  3.399337 0.057092 -0.985656
C  2.901706 -0.973779 1.177421
C  3.82754 -0.663946 0.154302
H  -2.776625 1.136437 -0.318936
H  -3.451305 -1.79118 0.413971
H  -4.620215 -0.606776 -0.201789
H  -1.019951 -0.895236 0.978322
H  -2.63928 1.515789 2.164923
H  -3.172433 -0.1674 2.476262
H  -4.290632 0.9954 1.708522
H  -3.303174 -0.384734 -2.358577
H  -2.092663 -1.54022 -1.750266
H  -3.763303 -2.090506 -2.073121
H  1.699159 1.030922 -1.967927
H  0.860105 -0.794273 1.879318
H  4.115434 0.308258 -1.775775
H  3.233345 -1.512956 2.071682
H  4.874568 -0.972503 0.249752
