program: Gaussian 09
title: 000221797
version: EM64L-G09RevD.01
frameworkgroup: C1[X(C10H11Cl2NO)]
method: RPBEPBE
basis: SDD
operation: Freq
keyword: #p
keyword: freq=noraman
keyword: PBEPBE/SDD
title: #p freq=noraman PBEPBE/SDD
converged: YES YES NO NO
title: Mulliken charges:
elementType: Cl Cl O N C C C C C C C C C C H H H H H H H H H H H
charge: -0.064002 -0.032154 -0.286771 -0.370772 -0.369993 -0.348688 0.344635 0.190742 -0.685855 -0.239956 -0.313635 -0.210484 -0.225792 -0.088911 0.255015 0.206332 0.205045 0.235985 0.305541 0.203817 0.225411 0.219810 0.294996 0.284273 0.265409
chargesum: 0.00000
title: Mulliken charges with hydrogens summed into heavy atoms:
elementType: Cl Cl O N C C C C C C C C C C
charge: -0.064002 -0.032154 -0.286771 -0.065231 0.091354 0.092343 0.344635 0.190742 -0.036817 -0.239956 -0.018639 0.073789 0.039618 -0.088911
polarizability: 2.11256253e+02 -4.14303111e+00 1.38856993e+02 9.07782593e+00 -3.97658525e+00 7.11002784e+01
1716.lowfreq: -8.5414 -4.8118 0.0012 0.0021 0.0025 6.0500 15.9290 35.9895 47.8961
frequency: 15.3929 35.9616 47.8554 80.2996 115.2114 149.8545 159.9725 199.9903 223.4018 238.3691 260.7320 289.1214 322.8150 368.6203 370.5942 433.9084 457.3218 509.4877 521.3251 541.2425 606.4364 650.9449 662.1706 721.9618 745.8046 763.5247 802.6181 848.9313 863.4332 863.4822 906.7743 975.5142 990.8311 1009.1592 1070.1739 1088.5665 1098.2976 1128.2160 1139.9676 1155.8897 1242.8397 1250.9728 1259.5489 1284.9738 1339.0490 1344.0263 1356.8869 1380.8043 1391.3518 1443.7431 1448.0110 1466.0953 1479.3255 1487.7441 1511.5988 1548.1821 1584.6547 1598.0051 2973.2061 2989.8828 3002.5459 3043.9899 3070.9880 3077.5888 3080.9140 3154.3171 3179.3321 3184.4462 3526.5149
redmass: 5.1213 5.3437 4.3939 4.3437 2.1984 4.6411 5.9854 11.5762 2.0067 1.9943 5.6791 6.8635 3.9713 3.3054 8.7126 3.2500 3.3962 3.3307 6.4410 5.5424 1.2478 7.1171 4.0292 4.6301 4.1002 1.5636 2.9746 1.4467 1.8115 1.6849 1.8651 2.1578 1.3578 3.8481 2.6525 2.3689 2.1147 1.5957 1.8978 2.7622 1.4307 1.2382 1.8114 1.2981 1.4350 3.5036 1.2780 5.6367 1.2283 1.8269 1.3315 1.0740 1.0525 1.0620 1.7136 8.8070 7.6553 6.7620 1.0362 1.0618 1.0632 1.0980 1.0997 1.0996 1.1025 1.0892 1.0960 1.0939 1.0785
irintensity: 0.8368 3.3193 2.5798 3.4643 1.1271 2.3767 0.1477 0.9892 0.8226 3.6104 2.7506 1.5079 1.1585 17.4790 5.7676 5.4033 13.1862 9.6964 9.8289 1.1569 111.0615 3.6589 7.4349 38.9254 3.9168 8.5810 55.3858 29.4193 29.8094 1.8337 12.1962 8.1018 2.2103 35.9564 6.5686 24.9330 3.2351 10.4072 4.5416 6.4354 5.9218 0.5728 60.5084 77.3047 2.8489 6.4856 1.7554 20.0047 22.5029 97.1444 18.8500 8.5309 15.2331 15.2853 243.6842 1.8597 122.6378 172.0459 29.7702 30.7286 42.4529 4.9515 52.7847 56.5691 26.1821 4.8701 2.5049 0.8445 67.1027
temp: 298.150 k
press: 1.00000 atm
elementType: 17 17 8 7 6 6 6 6 6 6 6 6 6 6 1 1 1 1 1 1 1 1 1 1 1
symmnumber: 1
zpe: 497262.0 jmol-1
zpe.correction: 0.189397 hartree
zpe.thermalcorrener: 0.203741 hartree
zpe.thermalcorrenthalpy: 0.204685 hartree
zpe.thermalcorrgfe: 0.145466 hartree
zpe.sumelectzpe: -1436.737911 hartree
zpe.sumelectthermal: -1436.723567 hartree
zpe.sumelectthermalent: -1436.722622 hartree
zpe.sumelectthermalfe: -1436.781841 hartree
dipole: -0.9251 1.7655 -0.8698
dipole: 2.1747
quadrupole: -91.2346 -99.8572 -97.8828
quadrupole: -6.5898 2.4803 0.0562
quadrupole: 5.0903 -3.5323 -1.5579 -6.5898 2.4803 0.0562
hfenergy: -1436.9273076 hartree
pointgroup: C01 [X(C10H11Cl2N1O1)]
dipole: 0.3449581 0.3425081 -0.704086 debye
dipolederiv: -0.405584 -0.0410577 0.258747 -0.058171 -0.0680429 0.0306167 0.2590878 0.0403749 -0.5674803 -0.9200656 -0.0815453 -0.0786903 -0.0891079 -0.0609742 -0.0055205 -0.132489 -0.009794 -0.1315268 -0.7690012 -0.0045612 -0.2046317 -0.0926874 -0.3950261 0.1074561 0.0616246 0.1372817 -0.9084664 -1.1392083 -0.0614642 0.1872568 -0.1961346 -0.5344776 0.1078381 0.2561319 0.0521899 -0.5546201 0.6596216 0.0089897 -0.0356248 0.1182385 0.2830867 -0.0608668 0.156277 0.0028446 0.0939396 0.0535395 0.0157315 0.0188401 -0.036476 0.0270812 0.0272838 -0.0309472 -0.00321 0.0944758 -0.5268461 -0.0551198 0.0133145 -0.0076114 0.0225834 0.0392892 -0.1192056 0.0215239 -0.335039 1.595935 0.1863671 0.0794658 0.3087612 0.3189095 -0.252298 -0.2882228 -0.2835789 1.1076938 0.0563376 0.0373615 -0.0138274 0.0723886 0.0376144 -0.0672707 -0.0112509 -0.0642641 -0.0461884 0.5652178 0.0747618 -0.4461748 0.0409636 -0.0530698 -0.0814244 -0.2211559 -0.0493837 0.8521557 0.1101313 0.024301 0.0078261 0.0552962 -0.0879051 -0.0120573 -0.1133793 -0.0090694 -0.001252 -0.6006668 -0.055847 0.120919 -0.0726426 -0.067286 0.0190206 0.1526134 0.0189325 -0.1939073 -0.3523627 -0.0145295 -0.1777011 -0.0222392 -0.1140796 -0.0239343 -0.1675952 -0.0193309 -0.0524522 1.3653926 0.1370566 0.1484213 0.1493877 -0.0439821 0.0054335 0.1131945 -0.0015539 0.2703627 0.0398374 0.024537 0.0471337 0.0282864 0.0640443 -0.039841 -0.0616252 -0.0971308 -0.0530365 -0.0633037 -0.046317 0.0259116 -0.0676733 -0.0762323 0.0803353 0.0540767 0.1429502 0.0381304 -0.2214054 -0.026213 -0.0855187 0.001827 0.0700889 -0.05368 -0.0678701 -0.0395508 0.0188621 0.082979 -0.06993 0.0677595 -0.0408918 -0.0542679 0.0588116 0.0529772 0.0664033 -0.0241932 0.2462111 -0.0205208 0.0557652 -0.0205013 0.3102934 0.0251371 0.0654433 0.0523048 0.2047445 0.0549831 -0.0693888 0.0538581 -0.1126829 -0.0660768 0.132838 0.05488 0.0755797 -0.0239941 -0.0064061 0.1267722 0.0469899 0.1571482 -0.0900537 -0.0641329 0.0354129 -0.0371679 0.0651419 -0.1064137 -0.0640879 -0.1035357 -0.0744233 0.0878557 0.0084522 -0.0862522 -0.0134378 0.031597 0.1677271 -0.003147 -0.0268219 -0.0165981 0.1528019 0.0066215 0.0086117 0.0020854 0.0516276 0.0833167 -0.0059367 -0.0242251 -0.0089731 0.1707323 -0.0003068 -0.0325712 0.0021906 0.030451 0.0300338 -0.0162125 0.064543 -0.0154835 0.1663824 0.0121991 0.0622336 0.0128109 0.0329743 unknown
polarizability: 210.6262229|12.1099801|71.4952702|-5.336971|-3.5104014|139.0920307 unknown
InChI: InChI=1S/C10H11Cl2NO/c1-2-5-13-10(14)8-4-3-7(11)6-9(8)12/h3-4,6,13H,2,5H2,1H3
charge 0 multiplicity 1
25 atoms
Cl 0.045816 -0.085307 -2.454531
Cl -4.984328 -0.686106 -0.338983
O  1.369856 -0.394952 2.030011
N  1.98649 0.365344 -0.069317
C  3.409826 0.490236 0.299079
C  4.222209 -0.801682 0.034577
C  -0.39891 -0.224878 0.386988
C  1.055779 -0.102448 0.829534
C  4.265478 -1.207532 -1.45377
C  -0.961933 -0.23103 -0.914686
C  -1.319247 -0.379996 1.463979
C  -2.344414 -0.373702 -1.153016
C  -2.704697 -0.517541 1.272259
C  -3.200762 -0.509126 -0.04588
H  3.453107 0.741391 1.372825
H  3.836651 1.332102 -0.278454
H  5.251595 -0.635242 0.409519
H  3.789671 -1.617975 0.642629
H  1.707538 0.563255 -1.032086
H  4.711585 -0.407143 -2.075207
H  4.870856 -2.120318 -1.598107
H  3.250863 -1.416432 -1.840914
H  -0.882229 -0.401683 2.467698
H  -2.736126 -0.380134 -2.172662
H  -3.380876 -0.630797 2.123518
