program: Gaussian 09
title: 000221795
version: EM64L-G09RevD.01
frameworkgroup: C1[X(C10H10N2O2)]
method: RPBEPBE
basis: SDD
operation: Freq
keyword: #p
keyword: freq=noraman
keyword: PBEPBE/SDD
title: #p freq=noraman PBEPBE/SDD
converged: NO YES NO NO
title: Mulliken charges:
elementType: O O N N C C C C C C C C C C H H H H H H H H H H
charge: -0.308322 -0.267337 -0.456369 -0.009813 0.479428 -0.276996 -0.440678 -0.354500 -0.426116 -0.194486 -0.209026 0.262183 -0.253781 -0.144504 0.247974 0.252742 0.224253 0.298052 0.333487 0.260602 0.292420 0.229453 0.229456 0.231877
chargesum: 0.00000
title: Mulliken charges with hydrogens summed into heavy atoms:
elementType: O O N N C C C C C C C C C C
charge: -0.308322 -0.267337 -0.122882 -0.009813 0.479428 0.223720 -0.216425 -0.056447 0.126906 0.034967 0.020430 0.262183 -0.021904 -0.144504
polarizability: 2.05833201e+02 9.49124332e-01 1.13807396e+02 -1.14189164e+01 -5.38579498e+00 6.34204894e+01
1716.lowfreq: -9.6713 -1.6354 0.0005 0.0005 0.0006 6.5479 31.4835 40.5924 63.7751
frequency: 31.4099 40.3297 63.3645 86.1748 94.4167 137.1447 159.5168 245.9344 271.2289 282.6296 343.4787 376.5157 406.5402 412.6859 507.0299 508.8082 609.0731 620.1516 646.4408 663.4540 695.8753 699.9681 767.7410 789.3075 830.0799 841.5777 896.5679 916.0042 944.1436 973.4487 985.1893 997.7514 1011.9499 1030.0367 1042.2390 1071.1555 1091.0673 1159.6572 1174.0751 1190.8664 1215.4330 1256.4632 1286.2610 1294.6813 1326.6685 1373.2593 1387.6844 1435.1746 1450.9365 1460.2135 1485.8133 1520.3441 1602.9128 1617.3163 1672.8527 2203.4047 3010.5182 3042.4482 3072.3984 3116.0672 3127.6435 3135.7850 3147.8588 3168.2781 3189.8911 3538.4588
redmass: 6.4314 7.4355 4.1091 4.1442 5.4403 3.8650 7.3354 4.3135 6.8816 3.5564 6.7266 3.7535 2.9238 5.9996 6.8934 3.0771 6.1295 6.1607 1.3651 5.2552 2.2309 3.8661 1.6595 1.2681 5.2207 1.2639 7.6888 1.4262 4.5510 1.3588 6.1607 1.3075 6.3014 2.4111 3.9392 1.7716 1.5607 3.5073 1.0518 1.1140 1.2033 2.1136 1.2457 1.1410 1.3877 1.3275 5.5961 2.2781 1.0885 1.0944 2.2491 2.1733 5.1504 6.0556 8.8055 12.4363 1.0588 1.0591 1.1016 1.0886 1.1085 1.0870 1.0934 1.0995 1.0955 1.0760
irintensity: 0.0721 1.8407 3.3394 6.2740 3.0032 1.5404 7.6831 0.4663 9.2070 19.2534 6.4326 1.9532 0.1155 7.2547 17.3209 20.6428 0.6533 1.9807 24.1861 21.0177 9.5311 78.1766 111.5161 2.5541 4.9060 0.4006 20.9900 13.7802 2.1947 0.1069 1.6112 2.2306 226.6291 12.8901 70.6140 31.1662 31.9936 356.1052 0.9586 6.4783 11.3162 7.0547 26.2615 5.7119 49.0157 28.9202 26.0490 94.4903 5.8480 33.2211 21.3919 485.2538 27.0457 89.2961 277.9396 13.6622 2.6299 23.8492 1.1482 13.3374 8.3424 0.6057 27.9870 20.7150 5.5892 35.0639
temp: 298.150 k
press: 1.00000 atm
elementType: 8 8 7 7 6 6 6 6 6 6 6 6 6 6 1 1 1 1 1 1 1 1 1 1
symmnumber: 1
zpe: 483015.0 jmol-1
zpe.correction: 0.183971 hartree
zpe.thermalcorrener: 0.196965 hartree
zpe.thermalcorrenthalpy: 0.197909 hartree
zpe.thermalcorrgfe: 0.142545 hartree
zpe.sumelectzpe: -646.004872 hartree
zpe.sumelectthermal: -645.991878 hartree
zpe.sumelectthermalent: -645.990934 hartree
zpe.sumelectthermalfe: -646.046298 hartree
dipole: -4.3021 -3.0945 0.6584
dipole: 5.3402
quadrupole: -103.8664 -76.3584 -82.8667
quadrupole: -7.1300 -1.4600 -0.3263
quadrupole: -16.1692 11.3388 4.8304 -7.1300 -1.4600 -0.3263
hfenergy: -646.1888431 hartree
pointgroup: C01 [X(C10H10N2O2)]
dipole: -1.545172 -1.4197506 -0.1044614 debye
dipolederiv: -2.1364708 0.0181013 0.0516937 0.4275937 -0.4950102 -0.0858625 0.1865921 -0.0478497 -0.3686777 -0.8434737 -0.0622475 0.0150232 -0.3118251 -0.9088787 -0.0266089 -0.0355594 -0.072999 -0.3398943 -2.0371772 -0.2115597 0.1171672 -0.5227076 -0.3993774 0.03891 0.1338527 0.0155459 -0.3334432 -0.3514491 -0.0251041 -0.0345488 -0.0453446 -0.2377061 -0.014408 0.0381697 0.0079004 -0.2227892 1.3703206 -0.0521827 -0.1361955 -0.3663998 0.0445146 0.0267277 -0.2064288 0.0000428 0.1222716 1.0925188 0.0869734 0.0704588 0.3551294 0.2914705 0.0190888 0.1885393 0.0840209 0.3728395 -0.3388072 0.0108291 0.0087051 -0.1351724 0.048667 0.0524276 -0.0040287 0.0338746 -0.2063254 -0.2684845 0.0142519 0.006054 0.2509513 -0.0820412 -0.0152602 0.0440229 0.0090609 -0.1726102 -0.1741117 -0.0934853 -0.0216033 -0.1665589 0.1450064 -0.0262223 -0.0495993 -0.0643864 0.0350691 0.115705 0.0147042 -0.0288221 0.0952134 0.1086972 0.0207651 -0.0199599 0.0303411 -0.1288253 0.0776798 0.0009296 -0.0265313 -0.0838306 0.1561415 0.0469121 -0.0387555 0.0381959 -0.1287928 2.8722598 0.1794001 -0.1465758 0.3978602 1.2910968 0.0495448 -0.1996468 0.1084087 0.3301977 -0.0412802 -0.0499867 -0.0292456 -0.0292516 -0.1466877 0.0093803 -0.0217573 0.0115795 -0.1790102 0.2280083 0.104188 0.006884 0.1206037 0.0006786 0.0050335 -0.1525527 -0.0296927 -0.0939346 -0.0589012 0.043837 0.0487966 0.0509952 0.026126 -0.0825913 0.0185277 -0.0568039 0.0331807 0.0220593 0.0222866 -0.0397164 -0.0880274 -0.0167931 0.095332 -0.0492332 0.0402322 0.0161598 0.0498718 0.0978395 0.0293679 0.0759576 -0.07805 -0.0422247 0.025785 -0.0451231 0.1605286 0.1363111 -0.0583084 0.001586 -0.0603777 0.0643758 -0.0099567 -0.0000643 -0.0078317 0.1779844 0.1917166 -0.0339901 0.0152936 0.0239885 0.1726628 -0.0194837 0.0254895 -0.0155216 0.3211499 0.0696199 -0.0179199 -0.0223929 -0.0105969 -0.0005182 0.0833441 -0.0156454 0.053984 0.0519146 0.0989152 0.0287053 0.0487727 0.0237962 0.0474595 -0.057397 0.0610444 -0.0267428 0.0884882 -0.0155844 -0.1014838 0.0074941 -0.1166117 -0.0286025 -0.0106963 0.0068741 -0.0121464 0.1559305 0.0583751 0.0468082 0.0176536 0.0744902 -0.0871584 -0.0402238 0.0222231 -0.0377734 0.1459954 -0.117621 0.0374139 0.0406813 0.0401249 0.0839267 -0.0165307 0.0421107 -0.016316 0.1625928 unknown
polarizability: 204.2608441|13.7976356|114.9589729|-8.9193938|7.3675208|63.8412689 unknown
InChI: InChI=1S/C10H10N2O2/c11-7-4-8-14-10(13)12-9-5-2-1-3-6-9/h1-3,5-6,12H,4,8H2
charge 0 multiplicity 1
24 atoms
O  1.83092 -0.65717 -0.526456
O  0.728922 1.3934 -0.130721
N  -0.413368 -0.685468 -0.269622
N  6.092515 1.450482 0.664937
C  -1.776382 -0.331272 -0.050341
C  3.106054 0.08008 -0.62766
C  -2.730988 -1.382615 -0.068458
C  -2.196933 1.004573 0.179485
C  3.642815 0.410702 0.788688
C  -4.095743 -1.102009 0.142799
C  -3.567848 1.26693 0.390156
C  0.684447 0.147842 -0.287557
C  -4.523817 0.225979 0.374389
C  4.995143 0.987006 0.730182
H  3.779832 -0.606207 -1.162343
H  2.956672 1.006262 -1.208416
H  -2.405864 -2.415526 -0.247205
H  -1.461139 1.811282 0.189403
H  -0.207125 -1.673118 -0.437304
H  3.668861 -0.512763 1.396704
H  2.958146 1.126196 1.278827
H  -4.823038 -1.920896 0.126352
H  -3.888373 2.299516 0.567397
H  -5.584009 0.444192 0.538763
