program: Gaussian 09
title: 000221786
version: EM64L-G09RevD.01
frameworkgroup: C1[X(C18H12O4)]
method: RPBEPBE
basis: SDD
operation: Freq
keyword: #pfreq=noraman
keyword: PBEPBE/SDD
title: #p freq=noraman PBEPBE/SDD
converged: YES YES NO NO
title: Mulliken charges:
elementType: O O O O C C C C C C C C C C C C C C C C C C H H H H H H H H H H H H
charge: -0.257410 -0.210530 -0.184964 -0.144848 -0.500825 0.220008 0.111547 0.308060 0.146246 -0.413526 0.319216 0.317166 -0.330254 -0.352132 -0.356860 -0.338262 -0.256212 -0.225142 -0.236354 -0.221854 -0.217423 -0.226686 0.307125 0.255921 0.277177 0.275534 0.230174 0.284923 0.236816 0.236879 0.235437 0.237123 0.236553 0.237377
chargesum: 0.00000
title: Mulliken charges with hydrogens summed into heavy atoms:
elementType: O O O O C C C C C C C C C C C C C C C C C C
charge: -0.257410 -0.210530 -0.184964 -0.144848 -0.193700 0.220008 0.111547 0.308060 0.146246 -0.157605 0.319216 0.317166 -0.053077 -0.076598 -0.126686 -0.053339 -0.019396 0.011737 -0.000918 0.015269 0.019130 0.010691
polarizability: 3.58773728e+02 -2.15352061e+01 1.72751694e+02 -3.04522697e+01 1.19364663e+01 1.49268844e+02
1716.lowfreq: -2.7581 -0.0010 -0.0007 -0.0002 1.6478 5.5613 19.8366 22.7823 33.1302
frequency: 19.5971 22.6883 33.1168 52.1746 86.9428 111.5868 126.6722 134.7659 140.5734 159.3946 179.5964 214.9754 284.9453 290.3198 353.1000 388.3312 396.3944 400.5943 422.8049 443.8737 452.0274 474.8713 491.7142 554.5937 594.8189 610.0260 612.6190 615.1300 646.0043 649.5829 679.9403 689.2836 693.2770 711.1857 784.6187 788.6331 805.7978 826.6047 852.6363 857.6202 865.6370 874.6042 915.0103 938.7334 943.9341 952.1028 986.7177 987.8815 989.0834 991.7550 994.1830 1009.3974 1009.9879 1028.4739 1031.4347 1086.6458 1091.0270 1093.2338 1164.9176 1175.9021 1177.8308 1197.9081 1198.6441 1217.0460 1252.8867 1266.5172 1288.2026 1291.1595 1329.9867 1330.4656 1388.8790 1389.4021 1436.9117 1439.5006 1479.9428 1481.7559 1568.4330 1573.3736 1584.7118 1594.5018 1605.7189 1610.2709 1612.6907 1699.8231 3094.2531 3133.0719 3134.3530 3144.4804 3144.5036 3154.2366 3156.5899 3163.6188 3169.0545 3172.8148 3185.0458 3193.0398
redmass: 4.0052 6.2772 7.7593 4.1527 8.2947 7.9056 5.9416 7.2111 6.3660 7.6231 6.1846 5.5258 8.2165 7.8159 6.1130 8.7049 2.7930 2.8183 4.4735 4.4701 7.4981 6.7029 7.1212 7.6283 7.0942 5.3438 6.2991 6.4618 7.2714 3.8921 6.5664 1.8592 1.9176 2.7166 1.8708 2.0822 6.0004 2.0862 1.5069 1.2765 2.5050 4.7942 4.9170 3.8672 1.4389 1.7176 2.8014 4.7726 1.5095 5.6884 1.8703 1.3444 1.3516 2.1347 2.0551 4.0023 1.6566 1.7961 1.4401 1.0671 1.0569 1.1286 1.1556 3.4224 1.6550 2.5906 1.5978 3.1900 1.4040 1.3599 8.2323 8.3233 2.2842 2.3407 2.1588 2.2497 7.7771 7.6107 6.3746 6.8278 7.3694 6.2643 6.1179 12.2079 1.0846 1.0857 1.0855 1.0885 1.0888 1.0929 1.0942 1.0964 1.0989 1.1014 1.0966 1.0917
irintensity: 0.2884 2.1278 2.4393 0.2280 1.6218 0.8081 0.8614 0.5854 0.2182 5.4814 0.6315 0.9038 1.4289 9.2706 2.5608 4.6128 0.0926 0.4809 9.4367 9.4931 4.7646 1.7188 12.2952 2.1374 5.4839 15.5037 4.5489 0.1751 3.1268 9.1865 30.9304 43.9509 50.2935 22.8573 53.8194 41.8723 76.7465 15.5275 11.8089 2.9964 55.2223 29.2773 35.8253 97.5907 5.8722 32.1191 3.2335 32.9012 8.0779 60.5993 1.9804 0.4788 3.1437 1.0122 4.4841 143.5938 16.7800 28.7647 211.3166 9.5820 0.1921 45.8311 28.3439 470.6371 57.1932 5.5444 29.1811 198.3940 30.6012 24.4437 4.6232 4.5000 25.6628 31.3161 2.2999 15.2288 151.2911 18.0346 143.7527 12.0398 643.0510 15.0962 17.0283 271.3687 0.3180 0.5688 0.4002 8.4874 5.2681 5.6148 23.8892 9.5859 22.9715 32.1083 7.2732 3.0238
temp: 298.150 k
press: 1.00000 atm
elementType: 8 8 8 8 6 6 6 6 6 6 6 6 6 6 6 6 6 6 6 6 6 6 1 1 1 1 1 1 1 1 1 1 1 1
symmnumber: 1
zpe: 655827.0 jmol-1
zpe.correction: 0.249791 hartree
zpe.thermalcorrener: 0.267765 hartree
zpe.thermalcorrenthalpy: 0.268709 hartree
zpe.thermalcorrgfe: 0.201138 hartree
zpe.sumelectzpe: -992.490430 hartree
zpe.sumelectthermal: -992.472457 hartree
zpe.sumelectthermalent: -992.471513 hartree
zpe.sumelectthermalfe: -992.539083 hartree
dipole: -0.7230 -2.0902 1.4888
dipole: 2.6661
quadrupole: -81.8702 -134.3549 -128.9748
quadrupole: 3.2283 -1.4241 0.4874
quadrupole: 33.1964 -19.2883 -13.9082 3.2283 -1.4241 0.4874
hfenergy: -992.7402216 hartree
pointgroup: C01 [X(C18H12O4)]
dipole: 0.2899106 0.5990274 0.8107846 debye
polarizability: 353.7221789|-38.3554751|180.8641576|29.1233829|-5.6340016|146.207929 unknown
InChI: InChI=1S/C18H12O4/c19-14-11-15(12-7-3-1-4-8-12)22-18(21)16(14)17(20)13-9-5-2-6-10-13/h1-11,16H
charge 0 multiplicity 1
34 atoms
O  1.473432 -0.984622 -1.302129
O  -0.858807 2.439292 -1.476992
O  -0.928549 -1.105659 0.669798
O  -0.03508 -2.039493 -2.653556
C  -0.825977 -0.01082 -1.521099
C  -0.188666 1.383139 -1.265788
C  -1.564198 -0.455029 -0.202994
C  1.919543 0.2076 -0.691348
C  0.178796 -1.080775 -1.902979
C  1.156585 1.357124 -0.721087
C  -3.000012 -0.08371 -0.043223
C  3.271852 0.059242 -0.124915
C  -3.649606 0.876105 -0.867474
C  -3.727281 -0.717413 1.004753
C  3.888434 1.124618 0.592233
C  3.978925 -1.166501 -0.283024
C  -5.007472 1.1880 -0.646199
C  -5.084959 -0.411477 1.211371
C  5.179871 0.96779 1.12897
C  5.27117 -1.317854 0.258292
C  -5.729276 0.541422 0.384139
C  5.878124 -0.253193 0.963501
H  -1.558715 0.067217 -2.338242
H  1.562517 2.300477 -0.352771
H  -3.09189 1.413646 -1.640694
H  -3.206189 -1.444769 1.635732
H  3.360365 2.071411 0.743128
H  3.503907 -1.986105 -0.827912
H  -5.500846 1.937441 -1.273795
H  -5.642978 -0.910211 2.01095
H  5.642417 1.793365 1.680055
H  5.804484 -2.265629 0.130467
H  -6.786536 0.780251 0.544825
H  6.882812 -0.372076 1.38361
