program: Gaussian 09
title: 000223700
version: EM64L-G09RevD.01
frameworkgroup: C1[X(C8H12N6)]
method: RPBEPBE
basis: SDD
operation: Freq
keyword: #pfreq=noraman
keyword: PBEPBE/SDD
title: #p freq=noraman PBEPBE/SDD
converged: NO NO NO NO
title: Mulliken charges:
elementType: N N N N N N C C C C C C C C H H H H H H H H H H H H
charge: -0.191364 -0.104949 -0.026411 -0.119269 -0.378448 -0.338469 -0.004579 0.176228 0.218850 -0.421242 0.007710 -0.617975 -0.604060 -0.600379 0.249991 0.240522 0.240500 0.255627 0.314049 0.320207 0.247272 0.247215 0.203903 0.240022 0.239957 0.205092
chargesum: 0.00000
title: Mulliken charges with hydrogens summed into heavy atoms:
elementType: N N N N N N C C C C C C C C
charge: -0.191364 -0.104949 -0.026411 -0.119269 -0.064400 -0.018262 -0.004579 0.176228 0.218850 -0.171251 0.007710 0.118675 0.094330 0.084692
polarizability: 1.86261649e+02 5.18158840e+00 1.55458121e+02 -1.08245972e-03 -9.30667176e-03 6.63807317e+01
1716.lowfreq: -25.9984 -11.2186 -2.6403 -0.0008 -0.0008 0.0002 7.3815 65.6301 72.7622
frequency: -25.8375 65.5617 72.7573 82.0231 95.9165 141.9754 144.2572 174.6948 177.8993 223.7981 256.4942 262.9644 341.1714 344.5604 419.7246 437.7819 493.2129 497.7507 519.4853 614.9670 620.6290 661.8111 700.6400 713.7543 726.7602 779.7131 817.3826 820.9648 924.1109 961.8948 986.3887 1077.1232 1110.7130 1123.3901 1125.4458 1127.6142 1155.7660 1169.5331 1185.7125 1231.3384 1241.4945 1269.2236 1319.8870 1376.2122 1398.6468 1413.4002 1419.4279 1436.6285 1442.5449 1451.2594 1454.8805 1463.5821 1467.7516 1480.7375 1489.6872 1496.9826 1504.9549 1549.8818 1581.8534 1605.0642 2979.8547 2986.8250 3000.5657 3056.8894 3066.9017 3088.5851 3095.3562 3102.5313 3125.3618 3191.7357 3591.7985 3592.4731
redmass: 1.0269 1.3813 2.4129 1.1474 2.1104 3.0110 3.1784 3.2612 4.4472 4.0578 3.1595 6.2532 7.0182 4.0106 4.8820 1.1975 4.6545 1.1386 7.4284 6.3986 3.9770 10.7335 6.6879 8.7909 6.0697 4.2031 7.0381 1.5948 5.3747 2.6375 3.4647 1.7307 4.6845 1.2819 1.2763 1.3070 2.7179 1.8311 1.7557 2.5091 4.2259 3.9929 6.4928 2.9665 2.7012 1.8419 1.4828 1.2810 1.6139 1.0419 1.0417 1.5517 1.0432 1.5044 1.1291 1.2097 1.5698 4.8847 6.7502 5.3986 1.0337 1.0335 1.0334 1.1012 1.1012 1.1023 1.1008 1.1015 1.1007 1.0971 1.0779 1.0774
irintensity: 0.1621 0.9963 2.3870 0.7135 6.3384 1.1155 0.5880 2.6341 1.5810 4.2178 1.8981 16.1044 4.2306 0.8805 8.5186 93.9149 8.1031 107.5586 4.3063 2.1375 3.4479 3.1846 21.3675 2.7428 6.4438 40.7773 3.5164 12.3300 11.7238 14.0473 3.9999 22.3297 40.8639 1.0939 2.3080 1.1143 7.7128 3.4749 4.9718 3.8647 26.6228 20.7936 27.0091 9.6709 124.0712 30.7068 13.9982 30.8789 29.8076 5.5644 20.1416 24.9375 14.7034 7.3438 3.1173 18.1755 47.6001 776.1705 116.2908 670.9500 80.7100 79.1932 61.2579 38.1159 31.2724 23.9367 33.8433 22.2436 4.6078 6.6666 85.6731 24.3916
temp: 298.150 k
press: 1.00000 atm
elementType: 7 7 7 7 7 7 6 6 6 6 6 6 6 6 1 1 1 1 1 1 1 1 1 1 1 1
symmnumber: 1
zpe: 545082.4 jmol-1
zpe.correction: 0.207611 hartree
zpe.thermalcorrener: 0.220931 hartree
zpe.thermalcorrenthalpy: 0.221875 hartree
zpe.thermalcorrgfe: 0.167436 hartree
zpe.sumelectzpe: -639.526479 hartree
zpe.sumelectthermal: -639.513159 hartree
zpe.sumelectthermalent: -639.512215 hartree
zpe.sumelectthermalfe: -639.566654 hartree
dipole: -2.9236 0.5215 0.0002
dipole: 2.9697
quadrupole: -79.3131 -63.6067 -85.4958
quadrupole: -5.3340 -0.0007 -0.0051
quadrupole: -3.1746 12.5319 -9.3573 -5.3340 -0.0007 -0.0051
hfenergy: -639.7340901 hartree
pointgroup: C01 [X(C8H12N6)]
dipole: -1.1342676 -0.2802615 -0.000097 debye
dipolederiv: -0.4973698 0.1675573 0.0000555 -0.3389269 -0.3582772 0.0000821 -0.0003229 -0.0001319 -0.1339319 -1.4677649 0.4443437 -0.0000291 0.1184045 -0.7231771 0.0000568 -0.0000436 0.0000511 -0.2536146 -0.7792009 -0.1025405 -0.000015 0.1342123 0.1302154 -0.0000138 0.0000388 -0.0000123 -0.2136331 -0.5222516 0.2018083 -0.0000161 0.2035772 -1.5016135 0.0000915 -0.0000054 0.0001211 -0.2384943 -0.5991016 -0.3986771 0.000167 -0.6920403 -1.2686463 -0.0000293 -0.0001278 -0.0005096 -0.4841374 -1.1378098 0.556295 -0.0001542 0.9062303 -0.91903 -0.0000684 0.0004598 -0.0005524 -0.5014182 -0.8097808 -0.3251893 -0.0000088 -0.0546193 -0.5941242 0.0000713 -0.000006 0.0000537 -0.0336777 1.0407633 -0.224324 0.0000204 -0.2409534 0.5703988 -0.0000661 0.0000925 0.0000081 0.0800306 1.0958035 0.2351104 -0.0000202 0.5407227 1.8283334 -0.000068 0.0000182 -0.0000147 0.2142936 0.4050981 -0.1690334 0.000052 -0.2580222 0.0213962 -0.0000022 0.0000531 -0.0000383 -0.1205551 1.6184837 -0.5806194 0.0000016 -0.7351788 1.5880018 -0.0000834 -0.0001149 0.0000019 0.1725195 0.3751909 0.1862749 -0.0001427 0.3880141 0.2822516 -0.0001848 -0.0000444 -0.0001086 0.2201001 0.5283277 0.231978 -0.0002163 0.0815013 0.2560197 0.0000525 -0.0000556 0.000189 0.231516 0.6827282 -0.1483702 0.0002581 0.0512055 0.1859279 0.0001319 0.0000234 0.0002058 0.2526043 0.0734282 0.0053358 -0.0000059 0.0419772 -0.0609091 0.0000094 -0.0000148 0.0000242 0.1708043 -0.0477427 -0.081406 -0.093631 -0.0450859 0.0679301 0.027999 -0.1472252 -0.0314213 -0.0538144 -0.0475281 -0.0815061 0.0935081 -0.0455188 0.0677349 -0.0277887 0.1473189 0.0317366 -0.0542767 0.085841 0.1146593 0.0001877 0.0186742 -0.0000197 -0.0001106 0.0001394 -0.0000928 0.1267453 0.040582 -0.0189188 -0.0000433 0.0348634 0.2155552 0.0000382 -0.0000274 0.0002041 0.3247747 0.0706805 -0.0112884 0.0000009 -0.0699291 0.227919 0.0000481 -0.00008 0.0002209 0.3339012 -0.0412216 -0.0622872 -0.0574267 0.0669399 0.0880412 0.0857219 -0.1048179 0.0266932 -0.0648899 -0.0414063 -0.0625134 0.0574991 0.0667886 0.0880469 -0.0856593 0.1049847 -0.0265237 -0.0651583 0.0618751 0.0070645 0.0000315 -0.094676 -0.1915961 -0.0001227 0.0000178 -0.0001306 0.1223782 -0.0453287 0.0210532 0.0326712 -0.1239465 0.075609 0.1052852 0.107268 0.0628201 -0.0770819 -0.0456334 0.0212514 -0.0327436 -0.1238662 0.0757411 -0.1052645 -0.1075399 -0.0626556 -0.0774352 0.0033379 0.073942 -0.0000004 0.1696523 -0.1517288 -0.0001261 0.0000113 -0.0001382 0.1224509 unknown
polarizability: 186.8078336|-3.1186762|154.911937|0.0016912|-0.0092155|66.3807317 unknown
InChI: InChI=1S/C8H12N6/c1-9-6-5-4-11-14(3)7(5)13-8(10-2)12-6/h4,9-10H,1-3H3
charge 0 multiplicity 1
26 atoms
N  2.471187 0.506714 0.000074
N  0.245362 1.545954 -0.000115
N  3.01964 -0.786291 0.000143
N  -1.58187 -0.120058 -0.000024
N  -1.215366 -2.436672 0.000047
N  -1.999459 2.188538 -0.000066
C  0.714368 -0.907353 0.000058
C  1.086352 0.476919 -0.000026
C  -0.699513 -1.160826 0.000059
C  1.953118 -1.632568 0.000081
C  -1.076166 1.166491 -0.000108
C  3.333623 1.682709 -0.000082
C  -2.656026 -2.711383 0.00021
C  -3.447671 1.980362 -0.000459
H  2.135454 -2.708266 0.000131
H  3.975548 1.691107 0.897179
H  3.973999 1.692174 -0.898458
H  2.683293 2.57081 0.000961
H  -0.559341 -3.216098 0.000391
H  -1.60863 3.12962 -0.00037
H  -3.14293 -2.274525 -0.889776
H  -3.142671 -2.275363 0.890767
H  -2.806907 -3.80401 -0.00029
H  -3.772221 1.412014 0.890021
H  -3.771987 1.413001 -0.891678
H  -3.943485 2.966098 0.000031
