program: Gaussian 09
title: 000224993
version: EM64L-G09RevD.01
frameworkgroup: C1[X(C6H6N2S2)]
method: RPBEPBE
basis: SDD
operation: Freq
keyword: #pfreq=noraman
keyword: PBEPBE/SDD
title: #p freq=noraman PBEPBE/SDD
converged: YES YES NO NO
title: Mulliken charges:
elementType: S S N N C C C C C C H H H H H H
charge: 0.242023 0.242092 0.012727 0.012773 -0.140118 -0.140540 -0.820823 -0.820661 -0.127404 -0.127321 0.288303 0.266302 0.279027 0.279032 0.288266 0.266321
chargesum: 0.00000
title: Mulliken charges with hydrogens summed into heavy atoms:
elementType: S S N N C C C C C C
charge: 0.242023 0.242092 0.012727 0.012773 -0.140118 -0.140540 0.012808 0.012959 -0.127404 -0.127321
polarizability: 1.44387290e+02 -7.99925313e-03 1.30061634e+02 5.95593480e-03 7.11583484e+00 7.44205535e+01
1716.lowfreq: -14.4950 -9.8824 -6.0532 -0.0037 -0.0034 -0.0026 57.6883 60.1908 82.2332
frequency: 57.6216 60.1662 82.0558 106.3973 112.7663 122.7369 165.4947 179.0113 185.3639 229.6541 249.7282 368.3643 372.7386 435.7035 481.7214 511.2306 527.7102 635.6194 635.9446 659.6801 816.3508 971.2472 972.7135 987.8048 988.6475 996.4271 1122.0843 1342.4365 1345.9105 1430.7156 1433.4040 1453.5208 1464.2728 1499.2238 2152.0955 2161.0833 3016.2600 3016.7325 3139.2019 3139.5229 3150.6916 3151.0079
redmass: 2.5064 6.5268 2.6902 1.4166 4.8919 1.5903 5.8779 4.1502 4.1250 4.3583 6.9010 9.7273 9.2160 14.1796 12.8149 11.8733 11.1737 7.9161 7.6923 10.6107 10.2139 1.4780 1.1690 1.2986 2.7815 1.4294 9.8706 1.1295 1.1210 1.0534 1.0605 1.0526 1.0792 8.7268 12.6391 12.6350 1.0280 1.0281 1.1046 1.1049 1.1054 1.1055
irintensity: 0.9412 0.1367 4.1910 0.6121 1.3980 0.1840 0.8910 0.2879 3.9864 0.0178 0.3433 2.2270 0.8290 1.4430 4.0592 0.0302 5.8473 1.5279 1.9266 0.0509 24.2691 5.9617 23.7119 8.8034 12.8413 20.3229 22.2560 5.1652 1.4348 12.5025 28.6073 15.3586 8.1721 26.3830 3.1919 13.7297 16.7603 13.6634 3.5925 0.5090 3.0589 4.0760
temp: 298.150 k
press: 1.00000 atm
elementType: 16 16 7 7 6 6 6 6 6 6 1 1 1 1 1 1
symmnumber: 1
zpe: 274728.8 jmol-1
zpe.correction: 0.104639 hartree
zpe.thermalcorrener: 0.117164 hartree
zpe.thermalcorrenthalpy: 0.118108 hartree
zpe.thermalcorrgfe: 0.064815 hartree
zpe.sumelectzpe: -1137.059298 hartree
zpe.sumelectthermal: -1137.046773 hartree
zpe.sumelectthermalent: -1137.045829 hartree
zpe.sumelectthermalfe: -1137.099121 hartree
dipole: -7.3163 0.0021 0.0012
dipole: 7.3163
quadrupole: -83.7662 -81.9044 -69.6083
quadrupole: 0.0008 0.0001 -7.0844
quadrupole: -5.3399 -3.4781 8.8180 0.0008 0.0001 -7.0844
hfenergy: -1137.1639368 hartree
pointgroup: C01 [X(C6H6N2S2)]
dipole: 0.0147083 2.8784103 -0.0041634 debye
dipolederiv: 0.0025994 -0.0074976 0.0947936 0.2209005 -0.3303671 0.0067761 -0.0364988 0.0180727 0.0314188 -0.0001812 0.0040451 0.0947918 -0.2247257 -0.328321 -0.0070401 -0.036393 -0.0166766 0.0312088 -0.2127413 -0.0385367 -0.0043381 -0.0845021 -0.1998899 -0.0250269 -0.0319892 -0.003882 -0.2280332 -0.2115247 0.0384668 -0.0041676 0.0846046 -0.2006994 0.0248775 -0.0322343 0.0039919 -0.228064 0.2229251 -0.4077753 0.0433652 -0.4517384 0.3352423 -0.0555413 -0.0356993 -0.2106946 -0.0831264 0.2325518 0.4094304 0.0426665 0.4532714 0.3279509 0.0540683 -0.0341944 0.2098723 -0.0835748 -0.1291172 0.0738578 -0.0737012 -0.0696538 0.0552909 0.0653203 -0.0683097 0.0799724 0.1058336 -0.1285412 -0.0725942 -0.0736183 0.0709803 0.054596 -0.064533 -0.0685528 -0.0796841 0.106023 -0.0356959 0.0963544 -0.0116056 0.1912122 0.0274631 0.0416327 0.0962976 -0.03087 0.1212808 -0.0384342 -0.0955949 -0.0117329 -0.1902996 0.0298058 -0.041082 0.0970806 0.0303081 0.1213117 0.0999871 -0.015263 0.0132704 -0.0209706 0.0075503 0.0506915 0.0873037 -0.0087888 -0.0448588 0.0424904 0.1137751 -0.0057747 0.1013233 0.0121995 -0.0053199 0.005624 -0.0280872 0.0841091 0.0068882 -0.1038203 -0.055403 -0.0554427 0.0944299 -0.0218716 -0.0178098 -0.0327968 0.0135177 0.0085045 0.1050626 -0.0548912 0.0567349 0.092691 0.0221709 -0.0172227 0.0329723 0.0134824 0.1007896 0.014201 0.0117264 0.0199197 0.0069499 -0.0510766 0.0864397 0.0075085 -0.044828 0.0394994 -0.1141113 -0.0053812 -0.101614 0.0151078 0.0059543 0.0061582 0.0287818 0.0842993 unknown
polarizability: 121.7641644|0.1553167|144.3861263|21.0587482|-0.2101364|82.7191871 unknown
InChI: InChI=1S/C6H6N2S2/c1-9-5(3-7)6(4-8)10-2/h1-2H3
charge 0 multiplicity 1
16 atoms
S  -1.650692 1.136689 -0.697378
S  1.664358 1.121989 0.694568
N  -1.750992 -2.565013 -1.114302
N  1.726426 -2.579236 1.123618
C  -0.61853 -0.329221 -0.317049
C  0.617218 -0.334537 0.318815
C  -1.640581 2.068228 0.950164
C  1.66118 2.050334 -0.954844
C  -1.221429 -1.555897 -0.74519
C  1.207403 -1.565928 0.751034
H  -1.976381 1.390897 1.748002
H  -2.367624 2.882798 0.808349
H  -0.642397 2.469817 1.178669
H  0.667903 2.465416 -1.180607
H  1.984686 1.366841 -1.7525
H  2.400053 2.854922 -0.817147
