program: Gaussian 09
title: 000224981
version: EM64L-G09RevD.01
frameworkgroup: C1[X(C8H11NO3)]
method: RPBEPBE
basis: SDD
operation: Freq
keyword: #p
keyword: freq=noraman
keyword: PBEPBE/SDD
title: #p freq=noraman PBEPBE/SDD
converged: YES YES NO NO
title: Mulliken charges:
elementType: O O O N C C C C C C C C H H H H H H H H H H H
charge: -0.246533 -0.175085 -0.354097 -0.113017 -0.228196 -0.230741 -0.430780 -0.438223 -0.378672 -0.400355 0.186052 0.153853 0.264843 0.274629 0.212112 0.239113 0.203031 0.244184 0.214240 0.195142 0.216440 0.211994 0.380068
chargesum: 0.00000
title: Mulliken charges with hydrogens summed into heavy atoms:
elementType: O O O N C C C C C C C C
charge: -0.246533 -0.175085 0.025970 -0.113017 0.036647 0.043888 0.020445 0.008992 0.030710 0.028079 0.186052 0.153853
polarizability: 1.12356525e+02 5.63863871e+00 1.09723477e+02 5.08460612e+00 -3.31862616e+00 7.24663092e+01
1716.lowfreq: -18.8191 -7.2445 -0.0008 -0.0006 -0.0004 7.7303 77.8194 99.7028 129.1668
frequency: 77.7250 99.6930 129.1651 174.2953 224.1257 246.7707 292.4374 325.4408 335.3807 379.8016 399.5338 437.5809 512.4605 534.3054 573.0893 619.6378 639.2368 722.5138 740.2480 796.4419 820.8942 869.1054 881.0057 910.1162 956.9029 993.4579 1035.0845 1066.1227 1068.1968 1077.7398 1120.8484 1137.4268 1157.1167 1187.4605 1218.1514 1229.7966 1260.1385 1288.8274 1295.0821 1305.9354 1311.6043 1336.0780 1341.7201 1348.0522 1357.9962 1435.3966 1461.9421 1466.4809 1471.0110 1478.8862 1614.9667 1699.1824 2967.9379 2973.9549 2981.0824 2982.1727 2991.1885 3042.8524 3043.0995 3045.1408 3054.6750 3064.5316 3321.2464
redmass: 4.2097 4.8151 5.8273 3.8720 2.8536 6.3016 6.1075 2.2590 4.4687 3.2166 1.1287 2.8213 4.9401 2.7038 7.9466 3.7035 5.6878 4.6665 3.1488 2.4377 2.2618 2.5109 2.2409 1.6611 2.6926 2.7616 3.4753 2.2548 1.7757 1.8496 1.1910 2.8841 2.5124 1.3839 1.4456 1.3958 1.3829 1.9555 1.3459 1.5227 2.8639 1.3641 1.3663 1.4610 1.4192 1.5000 1.0820 1.0846 1.0854 1.0889 11.6798 10.7186 1.0786 1.0657 1.0639 1.0617 1.0662 1.0928 1.0950 1.0956 1.1023 1.0977 1.0650
irintensity: 0.6316 0.3542 2.4080 0.7191 5.5959 12.1826 5.5524 0.9006 10.1946 6.0024 137.0459 1.3506 6.4145 4.0671 4.4826 2.4987 11.1064 15.4280 3.7277 2.8636 44.0051 1.1254 35.0223 14.7576 13.7436 37.9616 11.1698 17.2478 3.6315 46.7713 3.5225 61.7734 56.7045 23.1065 0.6034 1.8718 0.6723 11.9088 1.9479 5.6461 15.1699 0.8653 0.3688 1.0697 0.2225 136.6211 14.8353 9.7952 14.4324 12.6844 491.9035 104.2253 12.9470 24.0488 16.8077 30.7468 30.6500 39.5135 27.2172 20.9315 25.5586 50.9594 36.9802
temp: 298.150 k
press: 1.00000 atm
elementType: 8 8 8 7 6 6 6 6 6 6 6 6 1 1 1 1 1 1 1 1 1 1 1
symmnumber: 1
zpe: 484071.8 jmol-1
zpe.correction: 0.184373 hartree
zpe.thermalcorrener: 0.194969 hartree
zpe.thermalcorrenthalpy: 0.195914 hartree
zpe.thermalcorrgfe: 0.148403 hartree
zpe.sumelectzpe: -590.930037 hartree
zpe.sumelectthermal: -590.919441 hartree
zpe.sumelectthermalent: -590.918496 hartree
zpe.sumelectthermalfe: -590.966007 hartree
dipole: 3.3884 -2.0849 1.3452
dipole: 4.1997
quadrupole: -69.2876 -84.7600 -67.5385
quadrupole: 0.4984 0.2480 4.0095
quadrupole: 4.5744 -10.8980 6.3236 0.4984 0.2480 4.0095
hfenergy: -591.11441 hartree
pointgroup: C01 [X(C8H11N1O3)]
dipole: -1.2945837 -0.8521365 -0.5727093 debye
dipolederiv: -0.7840169 0.4701116 0.0083404 0.2559379 -0.9780818 -0.0655139 -0.1180201 0.0823136 -0.3475886 -0.4311921 -0.0405276 -0.0545812 0.1402282 -1.1475226 -0.0864916 -0.0283407 -0.2308565 -0.3564067 -0.6987033 -0.0714258 -0.1279639 -0.0023924 -0.1038686 0.0622834 -0.1936664 -0.0064552 -0.3526655 0.052052 0.4102619 0.1450372 0.3439506 -1.3996608 -0.0693902 0.1461681 -0.0474008 -0.0313867 -0.3843167 0.0140508 -0.0467296 -0.0183479 0.052739 0.0380019 0.0503142 0.1187611 0.1310299 -0.0478098 -0.0696262 -0.0778709 -0.0746584 -0.0545062 -0.0776654 -0.1845371 -0.088758 -0.0185166 0.0743674 0.0155252 -0.0077282 0.113955 0.0912436 0.0335315 -0.1410696 -0.0639007 0.1149299 0.1401106 -0.0024956 0.050676 -0.0212436 0.0256553 0.011399 0.0236577 0.0121019 0.1152714 0.0727318 0.0238641 0.0183431 -0.0361553 0.0285628 0.0230782 0.1045627 0.0492236 0.1329851 0.070517 0.0072927 0.0307194 0.016055 0.0493486 0.0244904 -0.0062407 0.0156582 0.0950314 0.8102886 -0.175471 0.0227394 -0.2944316 1.641746 0.1593865 0.1110409 0.1610781 0.1574971 0.8077344 -0.4875846 0.187386 -0.4167797 1.646023 0.1106977 0.2981373 0.1508859 0.361787 0.0675425 -0.0300296 -0.0293414 -0.0086552 0.0073666 -0.0660728 -0.0170788 -0.0753977 -0.0508291 -0.0083521 -0.0130655 0.0536886 -0.0377444 0.0486954 0.0191733 0.0567517 0.0487936 -0.0709194 0.0003009 -0.0182129 -0.0633149 -0.0436692 0.0526626 -0.0911072 -0.0560602 -0.0391924 -0.0909436 0.0318013 0.0370345 0.01736 0.0166976 -0.1482429 0.0222104 0.025436 0.0053318 0.0737412 -0.0528743 -0.005281 -0.0796938 -0.0435637 0.0840563 -0.07269 -0.0745955 -0.0128822 -0.1136837 0.0747352 -0.0300161 0.0127564 0.0318347 -0.1176396 0.0418005 0.0393743 -0.0085671 0.0803064 -0.0588199 -0.0686499 0.0929158 -0.0486377 0.0076984 0.079627 0.1217419 0.1016673 -0.0521758 0.0128095 -0.0095097 -0.0664138 -0.0034637 0.0180491 -0.0572895 -0.1307823 -0.1017579 -0.1103077 -0.189096 0.092556 0.0306317 0.0787235 0.0267943 0.0083658 0.0173561 0.0112959 0.0769806 0.0529283 -0.059558 -0.1054855 -0.0357561 0.0149043 -0.0343407 -0.0596243 -0.0399802 -0.110816 0.3872616 0.0107568 -0.0114704 0.0881164 0.1539772 -0.0134843 0.0154748 -0.0419623 0.3666795 unknown
polarizability: 111.8012835|-5.5491499|109.7760947|7.3689017|1.8637172|72.9689331 unknown
InChI: InChI=1S/C8H11NO3/c10-7-5-3-1-2-4-6(5)8(11)9(7)12/h5-6,12H,1-4H2
charge 0 multiplicity 1
23 atoms
O  2.031696 -1.925941 0.022176
O  0.600919 2.522877 0.367158
O  2.80942 0.619227 0.873708
N  1.56311 0.344584 0.241955
C  -0.23608 -0.927528 -0.573289
C  -0.485516 0.594552 -0.854553
C  -1.113681 -1.506202 0.58507
C  -1.92865 1.113629 -0.678761
C  -2.583769 -1.045942 0.487286
C  -2.663525 0.495925 0.531003
C  1.222884 -0.968414 -0.127269
C  0.569482 1.331239 0.00346
H  -0.380316 -1.535312 -1.482899
H  -0.175316 0.798081 -1.901043
H  -0.707137 -1.164073 1.558283
H  -1.028634 -2.607545 0.57333
H  -2.49825 0.876805 -1.598912
H  -1.892751 2.215782 -0.593381
H  -3.158418 -1.488947 1.322309
H  -3.041226 -1.417602 -0.452695
H  -3.717367 0.831257 0.52675
H  -2.215071 0.861479 1.476761
H  3.246597 -0.29013 0.881251
