program: Gaussian 09
title: 000224986
version: EM64L-G09RevD.01
frameworkgroup: C1[X(C13H12O3)]
method: RPBEPBE
basis: SDD
operation: Freq
keyword: #pfreq=noraman
keyword: PBEPBE/SDD
title: #p freq=noraman PBEPBE/SDD
converged: NO YES NO NO
title: Mulliken charges:
elementType: O O O C C C C C C C C C C C C C H H H H H H H H H H H H
charge: -0.169148 -0.147289 -0.166027 -0.476047 -0.166397 0.223766 -0.017875 -0.006412 0.255635 0.249001 -0.682487 -0.695965 -0.364881 -0.371411 -0.206427 -0.206136 0.292162 0.256010 0.234155 0.228504 0.221309 0.227956 0.233335 0.211538 0.279897 0.278367 0.242529 0.242338
chargesum: 0.00000
title: Mulliken charges with hydrogens summed into heavy atoms:
elementType: O O O C C C C C C C C C C C C C
charge: -0.169148 -0.147289 -0.166027 -0.183885 0.089613 0.223766 -0.017875 -0.006412 0.255635 0.249001 0.001480 -0.023135 -0.084984 -0.093044 0.036103 0.036201
polarizability: 2.03562408e+02 3.55970066e+00 1.48323164e+02 -1.67381122e+01 4.31767701e+00 9.50524925e+01
1716.lowfreq: 0.0007 0.0008 0.0012 5.1260 7.4438 12.1612 27.9302 32.9970 58.9698
frequency: 27.9220 32.9361 58.7547 103.9523 126.3239 140.7443 175.8023 183.5988 198.1283 212.3975 235.7388 279.1483 292.9659 326.8456 393.8808 405.2961 439.0238 511.0465 524.2407 548.8789 595.9684 611.5237 620.9723 671.8598 710.9549 751.7029 773.1194 777.0905 831.3487 860.9902 893.6490 911.2909 926.2551 959.6144 962.6990 984.3740 1004.1889 1013.0316 1018.9348 1068.7463 1082.5328 1096.7074 1114.6600 1147.7263 1172.1777 1175.7905 1186.2686 1214.5259 1251.0008 1279.3376 1281.9978 1342.5925 1379.6050 1396.5528 1409.6937 1452.8075 1454.3505 1463.5073 1466.4885 1478.1017 1485.9048 1591.3014 1598.0388 1620.1671 1625.6928 1663.9374 2979.6177 2986.2876 2993.1373 3051.6550 3082.7100 3090.0579 3092.5347 3099.0260 3139.4255 3153.4310 3165.4234 3174.4220
redmass: 4.4952 6.0901 2.8991 5.9007 5.9964 8.5156 1.7606 1.5873 4.6692 1.1769 6.6527 3.0933 3.5247 8.6606 2.7890 3.0866 4.6315 7.2349 7.4867 6.7849 6.3462 4.2440 4.8198 3.7412 5.1957 4.0811 4.1300 1.3689 4.3475 3.5741 3.4730 1.4956 1.1866 4.1113 1.4975 1.4250 3.0535 1.3710 2.5287 3.4824 2.4147 1.6287 2.3403 1.4122 1.2120 1.6332 1.9526 1.5562 3.8633 1.3844 1.5812 1.5891 1.1918 1.2018 7.5494 2.5268 2.5904 1.0447 1.0479 1.0465 1.0607 7.6569 7.6574 9.1195 9.9872 11.8191 1.0830 1.0343 1.0360 1.0837 1.0997 1.1004 1.1009 1.0998 1.0866 1.0903 1.0957 1.1004
irintensity: 3.1003 5.6467 0.2653 0.2578 0.0283 4.0162 0.5849 0.4307 0.4730 0.4294 0.0775 0.0113 10.5602 5.8749 1.3005 4.6050 0.4535 3.2293 1.3049 5.4455 19.5736 8.8649 14.8846 0.8607 0.0482 10.6518 0.0602 84.5764 3.0388 4.8787 0.3508 0.0709 3.7361 45.1769 20.9895 3.4127 7.1982 1.4210 103.6304 154.9088 13.5714 11.6221 33.4815 107.9387 12.3426 1.4335 26.7476 94.6313 224.4956 16.8620 5.7547 12.1946 17.7858 19.5837 6.3883 1.6240 0.6230 9.9413 1.1756 16.5692 19.3137 176.7769 4.4079 156.4302 144.9938 68.0278 6.2126 25.6223 24.9012 0.8516 32.3984 21.9979 21.8640 29.1432 1.8439 4.6289 4.4384 22.0623
temp: 298.150 k
press: 1.00000 atm
elementType: 8 8 8 6 6 6 6 6 6 6 6 6 6 6 6 6 1 1 1 1 1 1 1 1 1 1 1 1
symmnumber: 1
zpe: 565864.4 jmol-1
zpe.correction: 0.215526 hartree
zpe.thermalcorrener: 0.230364 hartree
zpe.thermalcorrenthalpy: 0.231309 hartree
zpe.thermalcorrgfe: 0.172448 hartree
zpe.sumelectzpe: -727.111576 hartree
zpe.sumelectthermal: -727.096738 hartree
zpe.sumelectthermalent: -727.095794 hartree
zpe.sumelectthermalfe: -727.154654 hartree
dipole: -2.2527 -1.3122 -0.8079
dipole: 2.7294
quadrupole: -66.6235 -102.9599 -98.0351
quadrupole: 1.0880 -6.5627 -2.7492
quadrupole: 22.5827 -13.7537 -8.8289 1.0880 -6.5627 -2.7492
hfenergy: -727.3271025 hartree
pointgroup: C01 [X(C13H12O3)]
dipole: 0.8971611 -0.5125911 0.2922688 debye
polarizability: 203.254428|-2.2825019|148.4571348|-17.9972717|-2.9286846|95.2265013 unknown
InChI: InChI=1S/C13H12O3/c1-7(2)11(14)10-12(15)8-5-3-4-6-9(8)13(10)16/h3-7,10H,1-2H3
charge 0 multiplicity 1
28 atoms
O  -1.617838 0.559044 -1.501694
O  0.014012 2.585094 0.680953
O  -0.361983 -2.225856 1.028595
C  -0.794745 0.227896 0.780109
C  -3.215677 -0.44287 0.0801
C  -1.874546 0.159783 -0.340667
C  0.231748 1.356615 0.544111
C  0.050287 -1.074612 0.734664
C  1.520765 0.714206 0.151971
C  1.414312 -0.696736 0.267127
C  -4.038021 0.655822 0.821047
C  -3.990125 -1.008539 -1.12679
C  2.723905 1.322233 -0.260818
C  2.508177 -1.538223 -0.025041
C  3.82072 0.482695 -0.559922
C  3.714191 -0.932082 -0.442936
H  -1.303455 0.323003 1.755427
H  -2.99357 -1.255589 0.80245
H  -4.291938 1.476956 0.127762
H  -4.977374 0.217382 1.201037
H  -3.492081 1.088018 1.679236
H  -3.425257 -1.818075 -1.62118
H  -4.17243 -0.220173 -1.877322
H  -4.963233 -1.414578 -0.797419
H  2.792012 2.411113 -0.345369
H  2.412841 -2.624246 0.07064
H  4.769962 0.921524 -0.88586
H  4.583242 -1.554905 -0.680911
