program: Gaussian 09
title: 000224972
version: EM64L-G09RevD.01
frameworkgroup: C1[X(C13H20ClN5)]
method: RPBEPBE
basis: SDD
operation: Freq
keyword: #p
keyword: freq=noraman
keyword: PBEPBE/SDD
title: #p freq=noraman PBEPBE/SDD
converged: YES YES NO NO
title: Mulliken charges:
elementType: Cl N N N N N C C C C C C C C C C C C C H H H H H H H H H H H H H H H H H H H H
charge: -0.039542 -0.114205 -0.114219 -0.162234 -0.033864 -0.033918 -0.402925 -0.402905 -0.375240 -0.377141 -0.375275 -0.377162 -0.395608 -0.396465 -0.395620 -0.396507 0.160113 0.160214 -0.318013 0.222055 0.190493 0.222047 0.190492 0.210066 0.201302 0.204204 0.212478 0.201307 0.210081 0.212492 0.204198 0.262356 0.206485 0.204016 0.281803 0.206486 0.262350 0.281782 0.204024
chargesum: 0.00000
title: Mulliken charges with hydrogens summed into heavy atoms:
elementType: Cl N N N N N C C C C C C C C C C C C C
charge: -0.039542 -0.114205 -0.114219 -0.162234 -0.033864 -0.033918 0.009623 0.009634 0.036128 0.039542 0.036112 0.039528 0.073232 0.089354 0.073217 0.089298 0.160113 0.160214 -0.318013
polarizability: 2.60491427e+02 8.55329286e-04 2.09062726e+02 -1.14927011e+01 1.51302877e-02 1.19200942e+02
1716.lowfreq: -12.8035 -5.6461 -4.5463 0.0014 0.0019 0.0026 33.8134 35.9192 49.5920
frequency: 33.6391 35.9005 49.5905 53.6795 91.6128 129.3635 141.1386 161.5628 181.6970 199.6122 211.2729 244.9149 264.8320 304.9720 311.1253 348.0402 377.9854 392.3962 398.3648 436.7231 438.1597 470.3314 493.9119 503.0829 582.3890 601.8224 604.2320 635.4855 690.3428 764.6352 775.9602 779.0247 804.2594 804.4897 830.2735 840.6829 848.9168 849.0691 888.9828 898.5632 902.4145 949.3111 949.9729 950.6933 984.4572 1018.2010 1026.5559 1051.6212 1066.3691 1082.6735 1089.6016 1120.6268 1124.4444 1147.1109 1150.8717 1153.2674 1156.8249 1189.1096 1229.5332 1242.7439 1254.0106 1254.9063 1264.9369 1274.6043 1281.6196 1292.7857 1299.6608 1327.0299 1327.7137 1337.3118 1338.4785 1344.0844 1344.5284 1345.5631 1346.4264 1361.4421 1361.9785 1400.0170 1456.1527 1456.3300 1463.2818 1463.4062 1463.8575 1464.7235 1470.3923 1470.5475 1476.3952 1477.7311 1486.6031 1537.6926 1577.7293 2955.4798 2955.6016 2958.8043 2959.5631 2968.0798 2968.1795 2986.3344 2986.3675 2988.5446 2988.5946 3036.8021 3037.0609 3047.4752 3047.5236 3055.9497 3055.9923 3099.5044 3100.5179 3103.3270 3103.4370
redmass: 3.5557 3.4514 3.8261 4.2023 3.3189 4.8609 6.0628 8.6744 8.9773 3.5047 2.2811 2.3379 2.1923 3.5815 2.6168 5.2383 4.2783 1.8368 1.9922 2.9214 3.0890 3.4129 2.5728 2.6720 2.4486 2.4467 6.8279 11.3481 11.2388 4.6969 11.7872 6.1796 1.5129 1.4900 3.2675 2.9455 1.4138 1.4237 9.2436 2.5381 2.5085 1.9384 1.3165 1.7970 2.7209 2.4754 2.3994 2.0314 2.3502 1.4730 1.4583 3.0900 2.2751 2.1302 2.1710 1.2980 1.3847 2.5701 2.1052 2.9355 1.2654 1.2734 1.8201 1.2164 1.7330 1.5595 2.6827 1.2617 1.2646 1.3617 1.3599 1.4707 1.4377 1.4277 1.4386 1.4701 1.4735 7.4711 1.0901 1.0914 1.0987 1.0898 1.1364 1.0947 1.0786 1.0985 1.2415 1.1017 3.3802 5.8594 6.9356 1.0699 1.0700 1.0703 1.0704 1.0639 1.0640 1.0613 1.0613 1.0609 1.0610 1.0962 1.0961 1.1026 1.1026 1.1032 1.1032 1.0925 1.0920 1.0931 1.0932
irintensity: 0.5634 0.1052 0.0409 0.1146 0.4961 0.2480 1.5783 0.0174 0.3774 0.0776 0.9167 3.6913 2.7675 3.3348 1.7467 11.9032 3.7952 0.0062 6.8496 0.0360 1.7353 0.3419 5.7674 1.6698 0.5632 2.7421 7.1964 0.7607 0.0375 2.1213 11.4009 52.2627 1.3666 0.1489 7.2028 8.5499 33.6918 14.1377 13.6554 6.4860 9.9087 80.1481 4.6173 15.4452 69.5021 0.0721 33.4173 20.9968 31.5992 15.6228 4.6457 28.8532 3.0445 8.0793 11.6351 1.2684 0.5605 106.8998 205.7013 2.1867 0.1320 1.6243 67.4929 19.1702 7.0309 33.2109 130.3998 0.1223 2.4922 23.5398 1.5303 16.6789 2.2628 0.1254 2.2889 37.1354 17.8557 539.1718 7.0128 5.3927 47.4090 7.9700 88.0248 1.7815 11.4749 9.6221 11.5247 0.0111 62.7435 1968.9451 158.8082 8.5838 20.8476 168.3520 13.9336 77.0432 23.6126 29.6205 28.5922 31.9955 33.1809 112.5179 19.0267 11.8626 51.5147 166.0739 20.1269 3.2562 8.6301 8.0435 1.1002
temp: 298.150 k
press: 1.00000 atm
elementType: 17 7 7 7 7 7 6 6 6 6 6 6 6 6 6 6 6 6 6 1 1 1 1 1 1 1 1 1 1 1 1 1 1 1 1 1 1 1 1
symmnumber: 1
zpe: 858228.0 jmol-1
zpe.correction: 0.326882 hartree
zpe.thermalcorrener: 0.344243 hartree
zpe.thermalcorrenthalpy: 0.345187 hartree
zpe.thermalcorrgfe: 0.280330 hartree
zpe.sumelectzpe: -1239.774676 hartree
zpe.sumelectthermal: -1239.757315 hartree
zpe.sumelectthermalent: -1239.756371 hartree
zpe.sumelectthermalfe: -1239.821228 hartree
dipole: -0.0010 -5.6699 0.0034
dipole: 5.6699
quadrupole: -98.2994 -129.4719 -119.4058
quadrupole: -0.0070 -1.8137 -0.0013
quadrupole: 17.4263 -13.7462 -3.6801 -0.0070 -1.8137 -0.0013
hfenergy: -1240.1015578 hartree
pointgroup: C01[X(C13H20Cl1N5)]
dipole: 0.0052326 -2.2306905 -0.0002368 debye
polarizability: 259.3750285|0.1006502|209.0628877|-16.9864259|-0.0972602|120.3171795 unknown
InChI: InChI=1S/C13H20ClN5/c14-11-15-12(18-7-3-1-4-8-18)17-13(16-11)19-9-5-2-6-10-19/h1-10H2
charge 0 multiplicity 1
39 atoms
Cl -0.008293 4.16756 -0.002168
N  2.296689 -0.293942 -0.556801
N  -2.29187 -0.303918 0.560321
N  0.002841 -0.356434 0.003002
N  -1.180058 1.7604 0.284216
N  1.175016 1.765546 -0.284194
C  4.833969 -1.54289 0.149597
C  -4.820792 -1.566004 -0.152495
C  3.481141 -2.228416 0.458553
C  4.671623 -0.004282 0.121597
C  -3.463778 -2.245594 -0.456004
C  -4.665913 -0.026582 -0.126058
C  2.385637 -1.769349 -0.532507
C  3.557717 0.418578 -0.86334
C  -2.373711 -1.77978 0.537907
C  -3.557212 0.403011 0.861879
C  1.131776 0.371318 -0.271865
C  -1.129619 0.366396 0.276405
C  -0.004081 2.336118 -0.001259
H  5.594292 -1.837578 0.89703
H  5.203088 -1.890169 -0.838318
H  -5.577256 -1.865245 -0.902038
H  -5.191578 -1.91368 0.834656
H  3.161936 -1.976589 1.488759
H  3.579392 -3.32957 0.402437
H  5.619394 0.482517 -0.177601
H  4.416651 0.364997 1.13396
H  -3.557061 -3.347108 -0.398515
H  -3.142333 -1.993879 -1.485544
H  -4.40943 0.342566 -1.138089
H  -5.616996 0.45604 0.169385
H  1.395349 -2.163758 -0.260694
H  2.636376 -2.124375 -1.554933
H  3.860544 0.160513 -1.900476
H  3.355683 1.498661 -0.8166
H  -2.626066 -2.1344 1.560063
H  -1.380694 -2.169864 0.26985
H  -3.360191 1.483989 0.814255
H  -3.862079 0.144997 1.898427
