program: Gaussian 09
title: 000225000
version: EM64L-G09RevD.01
frameworkgroup: C1[X(C11H19O8P)]
method: RPBEPBE
basis: SDD
operation: Freq
keyword: #p
keyword: freq=noraman
keyword: PBEPBE/SDD
title: #p freq=noraman PBEPBE/SDD
converged: YES YES NO NO
title: Mulliken charges:
elementType: P O O O O O O O O C C C C C C C C C C C H H H H H H H H H H H H H H H H H H H
charge: 1.420875 -0.546095 -0.258597 -0.505111 -0.501694 -0.268384 -0.584083 -0.257463 -0.284629 -0.643858 0.486891 0.291872 -0.492074 -0.261649 0.238225 -0.260912 -0.660759 -0.665493 -0.519975 -0.477419 0.262341 0.324951 0.325573 0.232637 0.226695 0.224709 0.232004 0.249158 0.232152 0.218298 0.230585 0.247946 0.215318 0.241520 0.302731 0.241111 0.254151 0.244044 0.244408
chargesum: 0.00000
title: Mulliken charges with hydrogens summed into heavy atoms:
elementType: P O O O O O O O O C C C C C C C C C C C
charge: 1.420875 -0.546095 -0.258597 -0.505111 -0.501694 -0.268384 -0.584083 -0.257463 -0.284629 -0.056566 0.486891 0.291872 -0.166501 0.197684 0.238225 0.195801 0.038849 0.028355 0.265386 0.265184
polarizability: 2.22349343e+02 -7.83946561e+00 1.77980486e+02 8.84847892e+00 -6.19715453e+00 1.39695910e+02
1716.lowfreq: -3.2307 -0.0004 0.0018 0.0018 4.6683 6.4691 19.4294 23.6026 37.4965
frequency: 19.1767 23.1512 37.4476 42.5759 45.6275 58.9263 68.1060 73.7594 81.3323 90.8453 102.4807 114.0402 127.2047 137.4786 157.8104 165.1693 176.1610 186.6896 205.7514 213.4178 226.6399 237.0315 260.1377 264.5697 275.2619 314.0327 338.2641 354.2784 359.7639 385.6176 413.0936 422.7179 472.7789 493.6500 539.3409 552.9568 598.9556 647.9293 687.7107 695.2789 699.9453 709.2241 796.1778 805.3651 814.2095 827.9802 877.5554 911.7312 916.1380 945.5964 953.6866 964.3570 970.7599 1014.3490 1027.2343 1066.4748 1094.4924 1095.5793 1108.5989 1112.7271 1128.5184 1130.9904 1132.0375 1140.3002 1156.7288 1156.9272 1176.9664 1254.0186 1277.9832 1279.4111 1314.2716 1350.9134 1356.0467 1383.0397 1390.0662 1393.2061 1423.5430 1430.2062 1436.8418 1455.7566 1457.3015 1458.9182 1463.3858 1464.9803 1470.0019 1472.8382 1484.0923 1484.9190 1487.8690 1595.2701 1634.4372 1643.5317 2982.8492 2990.2318 2992.7071 2994.6262 3002.5055 3029.5951 3031.3245 3063.6199 3088.2702 3090.3234 3093.1046 3095.5975 3102.6067 3113.9582 3119.0551 3121.6147 3136.8627 3141.8980 3160.0964
redmass: 4.3061 4.6320 3.3131 5.1126 3.1480 3.4260 5.5229 4.4866 4.8260 4.8175 4.0534 3.3146 2.8494 1.2914 3.6495 3.0756 1.1276 3.3947 1.9978 4.6049 1.4941 3.7260 2.1893 4.3855 3.5276 3.0857 3.6117 5.1978 5.9569 6.4404 4.9297 3.9610 4.2019 6.5746 4.4968 3.7820 7.6202 9.1446 5.3262 4.2257 5.1236 9.4614 1.9469 1.3160 1.8243 3.1219 5.7215 2.0086 1.9113 6.7032 3.2127 5.3742 4.2984 2.9344 3.8739 9.4287 2.2666 2.1933 2.5117 1.2365 2.5441 1.2517 1.2813 1.2767 1.6791 1.6788 2.6383 1.9994 1.1201 1.1200 1.4690 1.2702 1.3229 1.7759 1.2448 1.2331 1.1222 1.1142 1.1175 1.1021 1.0948 1.0513 1.0439 1.0420 1.0474 1.0543 1.0521 1.0515 1.0550 8.1235 8.5986 7.7464 1.0640 1.0293 1.0361 1.0362 1.0281 1.0593 1.0598 1.0953 1.0973 1.0975 1.1033 1.1031 1.1074 1.1062 1.1060 1.1062 1.1042 1.1053 1.0920
irintensity: 0.0939 1.9466 0.8411 0.0457 0.1132 5.7237 3.1930 1.2145 2.0224 0.4199 2.1602 12.8789 2.4907 0.8904 1.1241 0.3323 0.1174 0.4303 1.8170 0.3857 12.7528 10.0765 0.7189 6.4971 5.8588 39.2934 30.5848 6.6776 37.2705 33.6627 16.3393 4.8584 23.8699 10.6268 2.7966 10.9995 9.2865 259.9858 12.6398 58.2065 13.5004 108.4236 7.0373 11.8773 16.5070 8.3708 49.9014 32.4241 39.0557 156.1899 107.9824 325.1870 8.9981 98.5209 243.3657 42.3620 177.8074 19.2559 368.2438 2.1082 405.0510 1.6933 9.3787 0.9797 29.4878 7.1914 5.2708 113.0450 3.8802 7.9694 107.1387 13.8654 8.2476 79.0287 23.7694 17.8612 4.0176 70.8357 5.7652 18.4558 13.1558 11.7640 13.4926 14.5170 8.6410 16.2681 10.8452 13.1555 16.0821 162.0770 176.0438 493.0039 81.4013 42.1195 22.0617 17.5188 35.7806 34.4805 28.0862 10.6439 39.2385 31.9507 0.3803 1.0094 4.3558 21.2925 33.6604 32.2233 9.9954 11.7514 7.3296
temp: 298.150 k
press: 1.00000 atm
elementType: 15 8 8 8 8 8 8 8 8 6 6 6 6 6 6 6 6 6 6 6 1 1 1 1 1 1 1 1 1 1 1 1 1 1 1 1 1 1 1
symmnumber: 1
zpe: 787235.6 jmol-1
zpe.correction: 0.299842 hartree
zpe.thermalcorrener: 0.324822 hartree
zpe.thermalcorrenthalpy: 0.325766 hartree
zpe.thermalcorrgfe: 0.241737 hartree
zpe.sumelectzpe: -1371.968820 hartree
zpe.sumelectthermal: -1371.943840 hartree
zpe.sumelectthermalent: -1371.942895 hartree
zpe.sumelectthermalfe: -1372.026925 hartree
dipole: -1.8257 4.2674 -0.1797
dipole: 4.6450
quadrupole: -102.4165 -131.8801 -119.8266
quadrupole: -8.6188 4.9532 2.5439
quadrupole: 15.6246 -13.8390 -1.7855 -8.6188 4.9532 2.5439
hfenergy: -1372.2686619 hartree
pointgroup: C01 [X(C11H19O8P1)]
dipole: 1.4443708 -1.066515 0.3407074 debye
polarizability: 176.835794|4.9267643|214.7769333|3.3371543|-27.2972128|148.4130121 unknown
InChI: InChI=1S/C11H19O8P/c1-5-17-10(12)7-9(8-11(13)18-6-2)19-20(14,15-3)16-4/h7H,5-6,8H2,1-4H3
charge 0 multiplicity 1
39 atoms
P  -2.790924 -0.993098 0.341589
O  -1.221779 -0.625649 1.088145
O  2.692443 -1.569216 1.587033
O  -2.440819 -2.445548 -0.500397
O  -3.639226 -1.588043 1.684448
O  -0.401053 3.538331 -1.112094
O  -3.497166 0.187112 -0.436393
O  1.367168 -1.677692 -0.328967
O  1.470328 2.720689 0.021652
C  1.019981 0.11336 1.357556
C  -0.329964 0.409548 0.755888
C  1.668072 -1.127691 0.7561
C  -0.679567 1.507717 0.018777
C  3.511801 -2.723831 1.094527
C  0.257998 2.5936 -0.315673
C  0.394828 4.734532 -1.520593
C  4.647329 -2.231246 0.194086
C  0.331973 5.820361 -0.442051
C  -1.597295 -2.37805 -1.731872
C  -3.114094 -2.73975 2.466592
H  0.933261 -0.027786 2.449532
H  1.683739 0.981202 1.177215
H  -1.700957 1.625185 -0.356014
H  2.845384 -3.423735 0.560566
H  3.886558 -3.184888 2.022013
H  -0.086252 5.055203 -2.458431
H  1.435476 4.418599 -1.711383
H  4.248833 -1.776118 -0.728055
H  5.271337 -1.48778 0.718831
H  5.291387 -3.083339 -0.092322
H  -0.714449 6.084277 -0.211289
H  0.828765 5.482524 0.482781
H  0.848486 6.730902 -0.798846
H  -2.032418 -1.663297 -2.4523
H  -0.562616 -2.103782 -1.464588
H  -1.637207 -3.398429 -2.139597
H  -2.975902 -3.615291 1.811331
H  -2.164684 -2.46436 2.95612
H  -3.896273 -2.929925 3.215482
