program: Gaussian 09
title: 000224949
version: EM64L-G09RevD.01
frameworkgroup: C1[X(C15H23NO)]
method: RPBEPBE
basis: SDD
operation: Freq
keyword: #p
keyword: freq=noraman
keyword: PBEPBE/SDD
title: #p freq=noraman PBEPBE/SDD
converged: YES YES NO NO
title: Mulliken charges:
elementType: O N C C C C C C C C C C C C C C C H H H H H H H H H H H H H H H H H H H H H H H
charge: -0.422587 -0.105527 -0.177502 -0.436385 -0.436570 -0.400644 -0.399891 -0.382949 0.447386 -0.179872 -0.405714 0.311717 -0.282681 -0.471435 -0.373359 -0.631427 -0.617383 0.130684 0.218754 0.202979 0.203277 0.219197 0.190558 0.203887 0.203978 0.190087 0.190526 0.201589 0.227017 0.224303 0.228223 0.220660 0.280070 0.339654 0.249068 0.188201 0.219547 0.186577 0.226317 0.219669
chargesum: 0.00000
title: Mulliken charges with hydrogens summed into heavy atoms:
elementType: O N C C C C C C C C C C C C C C C
charge: -0.082932 -0.105527 -0.046818 -0.014651 -0.014096 -0.006200 -0.005826 0.009166 0.447386 -0.179872 -0.178697 0.311717 -0.062021 -0.018909 -0.093290 0.025390 0.015179
polarizability: 2.29002596e+02 -7.43457255e-01 1.60258078e+02 3.13058274e+00 -1.64984864e-02 1.24543341e+02
1716.lowfreq: -5.9623 0.0002 0.0005 0.0008 5.1128 13.5185 28.0666 36.8772 68.4416
frequency: 25.9499 36.4101 68.4262 75.0803 86.4272 120.2790 167.3702 197.1072 221.8726 228.7833 238.3599 246.7582 252.9678 276.9261 324.3583 337.2788 340.3704 356.1560 374.1107 423.8563 433.0140 448.7508 480.3540 533.0373 536.3456 545.9423 562.5731 620.0485 739.9088 751.9285 780.7838 786.7541 791.5117 806.9823 827.7230 849.3225 873.6613 888.1660 911.7565 925.3160 929.0146 969.6598 993.4821 1000.9491 1036.9363 1039.5618 1048.3477 1050.8123 1064.8635 1068.8349 1092.0228 1112.5492 1129.5891 1137.0761 1149.6951 1166.5700 1177.4736 1182.1827 1189.7387 1233.6047 1249.2506 1251.9847 1257.9103 1268.7414 1274.6616 1289.5546 1291.2419 1303.3216 1320.9261 1334.8220 1339.9085 1345.0687 1351.5857 1360.5152 1400.9694 1419.6648 1437.9846 1446.4628 1457.8919 1458.8908 1460.9067 1462.0738 1462.4983 1466.0823 1470.1110 1476.1381 1476.3695 1478.9044 1486.9144 1599.1692 1615.7382 2847.3514 2861.0123 2879.2463 2893.1144 2962.4538 2963.3673 2967.1410 2975.6121 2978.9771 2992.3820 3015.5396 3024.3224 3025.8511 3029.0305 3034.0832 3038.8253 3046.6479 3075.0253 3084.5936 3114.6726 3137.3961 3157.2077 3549.3095
redmass: 3.2276 3.1983 3.1758 3.5401 3.3645 3.1856 3.9324 3.4102 1.7611 1.8607 1.0928 1.6067 2.7690 4.3099 2.7585 3.5051 1.9522 2.0298 1.1540 2.4865 2.9974 2.7339 1.7215 5.2139 3.5790 3.7307 4.2975 4.2108 3.3708 3.2942 1.4614 2.3916 1.8150 4.4868 4.4093 1.9772 1.9612 1.4618 1.6031 1.7459 2.4199 1.6190 2.1692 1.4685 1.7141 1.8681 1.2385 1.7728 2.0686 1.3358 1.2517 2.4930 1.9345 1.4069 1.4865 1.8224 1.6909 1.4741 1.9314 1.4336 1.9383 1.3436 1.7435 2.2843 1.7031 1.2085 1.5884 1.3986 1.3575 1.3770 1.4899 1.5961 1.5242 1.5822 3.0642 1.1402 1.2881 2.5115 1.3361 1.0901 1.0555 1.1005 1.0913 1.4163 1.1850 1.1025 1.1145 1.0794 1.0550 6.2959 7.0104 1.0570 1.0572 1.0798 1.0682 1.0638 1.0642 1.0619 1.0609 1.0621 1.0885 1.0719 1.0727 1.0968 1.0944 1.1011 1.1030 1.1033 1.1010 1.1007 1.0872 1.0903 1.0981 1.0649
irintensity: 0.0193 0.2097 0.5951 0.7039 0.5812 1.4481 0.4122 0.2830 0.0034 0.3261 0.8259 1.9815 3.9533 1.6688 4.5179 9.3954 0.7314 2.7983 92.7638 3.4921 0.8117 1.0163 0.5651 10.6285 4.9866 0.4837 1.8805 6.1638 2.4428 13.1291 3.1308 10.4128 29.9504 31.2043 5.3052 6.8803 3.8337 9.1857 0.7522 0.8887 10.2110 7.0390 9.2584 3.7980 18.0747 56.6837 0.0641 0.4746 42.1001 0.3165 5.7156 0.0036 17.8625 6.2838 90.6047 2.6406 21.3471 0.5853 22.7725 2.6882 19.2513 1.3377 20.6004 2.2704 6.4278 0.4447 26.4435 3.2013 0.0135 0.2497 0.4313 7.3594 2.5901 6.7089 15.7575 3.7933 5.2215 58.1325 8.7032 3.3924 17.2824 10.6269 10.1021 8.1113 15.7382 2.2281 19.8819 6.2341 10.7129 6.9025 0.1116 86.5970 177.2525 43.8993 70.8876 31.1181 45.3102 34.3442 17.2089 26.4036 22.2421 45.3118 38.8938 82.6669 77.7570 11.3426 8.5661 107.6451 32.3232 44.4490 14.4939 9.1313 21.7098 23.7359
temp: 298.150 k
press: 1.00000 atm
elementType: 8 7 6 6 6 6 6 6 6 6 6 6 6 6 6 6 6 1 1 1 1 1 1 1 1 1 1 1 1 1 1 1 1 1 1 1 1 1 1 1
symmnumber: 1
zpe: 916549.5 jmol-1
zpe.correction: 0.349095 hartree
zpe.thermalcorrener: 0.366351 hartree
zpe.thermalcorrenthalpy: 0.367295 hartree
zpe.thermalcorrgfe: 0.303880 hartree
zpe.sumelectzpe: -714.038389 hartree
zpe.sumelectthermal: -714.021133 hartree
zpe.sumelectthermalent: -714.020189 hartree
zpe.sumelectthermalfe: -714.083604 hartree
dipole: 1.8222 -0.7031 0.5148
dipole: 2.0199
quadrupole: -94.0686 -101.9980 -105.9911
quadrupole: 0.3469 -0.9930 0.5251
quadrupole: 6.6173 -1.3121 -5.3052 0.3469 -0.9930 0.5251
hfenergy: -714.3874844 hartree
pointgroup: C01 [X(C15H23N1O1)]
dipole: -0.7234238 0.3287714 0.0092238 debye
polarizability: 229.0695863|-0.8123745|148.7480806|-1.7121249|-16.7071107|135.9863483 unknown
InChI: InChI=1S/C15H23NO/c1-16(2)11-13-9-6-10-14(15(13)17)12-7-4-3-5-8-12/h6,9-10,12,17H,3-5,7-8,11H2,1-2H3
charge 0 multiplicity 1
40 atoms
O  0.425761 1.565286 -1.144544
N  4.257099 0.292319 0.044279
C  -2.096336 0.29088 -0.106177
C  -2.81144 0.681091 1.220928
C  -2.971984 -0.702695 -0.92513
C  -4.234876 1.231472 0.969372
C  -4.394736 -0.147259 -1.171069
C  -5.091614 0.2311 0.157662
C  -0.686984 -0.252209 0.141987
C  0.482138 0.388005 -0.359664
C  -0.508315 -1.438402 0.899282
C  1.786978 -0.117017 -0.112154
C  0.775055 -1.964852 1.149983
C  3.005836 0.594683 -0.691484
C  1.915465 -1.30228 0.643535
C  4.31091 0.961593 1.360664
C  5.463645 0.559847 -0.761197
H  -2.053814 1.227686 -0.713632
H  -2.19756 1.421198 1.769303
H  -2.875905 -0.216785 1.86778
H  -3.041196 -1.659136 -0.368631
H  -2.471499 -0.933298 -1.885184
H  -4.167771 2.189393 0.411835
H  -4.724218 1.461182 1.935723
H  -4.998433 -0.892747 -1.724031
H  -4.331192 0.753558 -1.817348
H  -5.247912 -0.687587 0.760371
H  -6.093255 0.658115 -0.04277
H  -1.391154 -1.954631 1.29557
H  3.143458 0.264729 -1.741047
H  2.799529 1.690746 -0.742001
H  0.887617 -2.884036 1.734991
H  2.928542 -1.678862 0.821456
H  -0.51351 1.861851 -1.245807
H  3.419927 0.691712 1.952963
H  4.34692 2.078147 1.280299
H  5.207193 0.626697 1.913357
H  5.591969 1.639757 -1.030696
H  5.425437 -0.02394 -1.698391
H  6.361126 0.24469 -0.198384
