program: Gaussian 09
title: 000224853
version: EM64L-G09RevD.01
frameworkgroup: C1[X(C6H11BrN2O2)]
method: RPBEPBE
basis: SDD
operation: Freq
keyword: #p
keyword: freq=noraman
keyword: PBEPBE/SDD
title: #p freq=noraman PBEPBE/SDD
converged: YES YES NO NO
title: Mulliken charges:
elementType: Br O O N N C C C C C C H H H H H H H H H H H
charge: -0.053722 -0.220671 -0.302289 -0.385602 -0.643332 -0.470921 -0.415715 0.011875 -0.363167 -0.308139 0.281679 0.309878 0.258881 0.216685 0.256666 0.205720 0.240462 0.187623 0.229866 0.310745 0.310426 0.343053
chargesum: 0.00000
title: Mulliken charges with hydrogens summed into heavy atoms:
elementType: Br O O N N C C C C C C
charge: -0.053722 -0.220671 -0.302289 -0.074856 0.010146 -0.161044 0.059851 0.268541 0.083015 0.109350 0.281679
polarizability: 1.14896725e+02 1.53402543e+00 1.08868163e+02 -3.41207845e+00 1.26645549e+01 7.62094780e+01
1716.lowfreq: -10.3600 -4.6747 -0.0002 0.0000 0.0004 13.6618 52.5239 73.3558 74.1277
frequency: 52.3679 73.3395 74.0965 112.4850 159.5242 210.0304 250.1762 299.1570 331.1760 345.1293 393.0887 447.0147 481.8985 491.2224 498.8910 567.9128 583.6249 620.9255 694.7966 720.8837 822.2349 849.7681 856.5213 901.0348 933.6795 979.8430 995.6606 1027.8531 1049.2822 1079.4994 1108.1891 1157.3705 1185.0661 1198.8839 1221.3930 1250.2394 1273.2452 1290.9060 1313.5119 1342.7442 1345.7778 1354.2312 1364.0311 1446.7908 1455.8120 1463.7521 1484.3042 1606.0310 1657.5235 2938.9326 2939.9858 2961.9938 3004.9268 3063.1978 3070.9858 3078.1714 3085.8841 3532.3075 3546.1098 3701.0232
redmass: 6.6112 5.2301 4.5052 5.3820 5.2618 5.3462 2.9733 1.4996 2.4583 1.9844 2.7613 3.5677 3.2578 2.9230 1.2364 2.3401 1.4317 4.9893 3.2993 8.4469 3.7491 2.2231 1.8694 2.7983 2.6327 2.5470 3.2080 1.9574 2.0549 1.8801 1.7983 1.3288 1.4430 1.6223 1.9368 1.1885 1.3319 1.5160 1.2715 1.3785 1.4199 1.6360 1.6142 1.0829 1.0859 1.1031 2.2858 1.3008 3.8516 1.0694 1.0809 1.0678 1.0614 1.0944 1.0993 1.0880 1.0969 1.0742 1.0485 1.1041
irintensity: 8.4078 12.9355 8.8779 4.2450 2.9927 7.6214 0.3234 1.6569 4.0474 3.5024 27.3433 20.7056 36.7757 34.2182 263.3441 24.2286 109.9150 3.6147 5.6713 22.6493 16.6246 10.8316 45.5540 56.8508 9.1612 7.5312 123.4862 11.8404 6.0485 12.8625 14.1573 3.9391 59.6432 13.6391 43.4335 3.2953 29.4156 35.6688 53.3715 2.2164 5.9578 33.9247 53.9468 11.9619 19.0619 18.7342 552.0339 65.5352 295.8666 60.5401 21.3925 24.0944 33.4047 21.1201 28.6865 14.9641 27.0899 35.9184 37.6767 39.6302
temp: 298.150 k
press: 1.00000 atm
elementType: 35 8 8 7 7 6 6 6 6 6 6 1 1 1 1 1 1 1 1 1 1 1
symmnumber: 1
zpe: 462634.4 jmol-1
zpe.correction: 0.176208 hartree
zpe.thermalcorrener: 0.187652 hartree
zpe.thermalcorrenthalpy: 0.188596 hartree
zpe.thermalcorrgfe: 0.137499 hartree
zpe.sumelectzpe: -507.797316 hartree
zpe.sumelectthermal: -507.785873 hartree
zpe.sumelectthermalent: -507.784928 hartree
zpe.sumelectthermalfe: -507.836026 hartree
dipole: 1.0089 -0.9086 0.0454
dipole: 1.3584
quadrupole: -72.5332 -70.7932 -75.7466
quadrupole: 18.4694 7.6303 3.1539
quadrupole: 0.4912 2.2311 -2.7223 18.4694 7.6303 3.1539
hfenergy: -507.9735246 hartree
pointgroup: C01 [X(C6H11Br1N2O2)]
dipole: 0.2369635 0.4595443 0.1352757 debye
dipolederiv: -0.2293134 -0.0651459 0.0071472 -0.068019 -0.4135917 -0.1971546 0.0085906 -0.2794918 -0.3962093 -0.9858197 0.188747 0.0362663 0.3310517 -0.6252252 0.026998 -0.125187 0.1717747 -0.3229491 -0.7813628 -0.1207597 -0.0191625 -0.1528938 -0.6641945 -0.3189595 -0.0519881 -0.3295975 -0.7901158 -1.6127933 -0.2074264 -0.0711152 -0.412852 -0.6517536 0.0606629 -0.0456337 0.0763606 -0.3435771 -1.1878869 0.1648922 0.3282186 0.2556729 -0.5969005 0.1399284 0.4253705 0.1708933 -0.6412455 0.064341 0.0783515 0.0240305 0.1065756 0.4658149 0.4313949 -0.03164 0.6082429 0.564049 -0.0311263 -0.0427894 -0.0133608 -0.008142 -0.0342542 -0.0399978 0.0578359 -0.1033719 -0.0364993 1.212753 -0.1247208 0.0690512 -0.5091062 0.5261011 -0.1723131 -0.0682683 -0.5758828 0.18098 -0.0293467 -0.0311131 0.0066162 -0.0391954 -0.0189055 0.0811024 0.0555569 0.0038775 0.0589159 0.604511 -0.1563252 -0.0593275 -0.0408289 0.4164614 0.0739921 -0.1674083 0.1519022 0.3077708 2.2790138 0.2724904 -0.2365602 0.4465776 0.8219524 0.5124864 -0.1098585 0.5277054 1.0493791 0.0190349 0.0454052 -0.0566617 0.0453524 -0.0580725 -0.0285497 -0.0625218 -0.0025245 -0.0699203 -0.0209648 -0.0779688 0.0417529 -0.0940165 -0.0663729 0.0741801 0.0137264 0.054426 0.0871361 0.0373865 0.0508587 -0.0199813 0.0210975 0.0144866 -0.1398319 -0.0457174 -0.0740237 -0.0918611 0.1489535 0.0129741 -0.0217956 0.0712138 -0.0091223 -0.0752583 0.0258703 0.0906291 -0.0230516 -0.1396878 0.0955552 0.0777149 0.0783248 0.0319181 -0.0241071 0.1158601 -0.0317463 0.0477857 0.0907205 -0.0354371 -0.0328487 -0.0676868 0.010779 -0.0655127 -0.0781032 -0.0374594 -0.0600333 -0.0380543 -0.0344596 -0.0430876 -0.0027363 -0.0200005 -0.0738741 0.0405067 -0.1975996 -0.1271664 -0.0157785 0.0667389 -0.0313571 0.0718044 -0.0353141 0.0796584 -0.043362 0.1351231 -0.016037 0.1801503 -0.0012702 -0.0066006 0.0445886 0.3070745 -0.1016845 0.0483717 -0.111359 0.1764282 0.2022038 -0.0456704 0.0047584 -0.0559357 0.2891769 -0.134092 0.0115363 -0.1398494 0.2000326 0.2330661 -0.0329265 0.0163027 -0.0208468 0.3099424 -0.1090683 0.0264628 -0.1080291 0.2461882 unknown
polarizability: 114.6772|3.3829104|96.0450748|-3.4698882|20.2703111|89.2520917 unknown
InChI: InChI=1S/C6H11BrN2O2/c7-4-2-1-3-11-5(4)9-6(8)10/h4-5,9H,1-3,8H2
charge 0 multiplicity 1
22 atoms
Br 1.115549 2.357968 1.034715
O  0.701903 -1.009887 0.80388
O  -2.47657 -1.221459 -0.984185
N  -1.264371 0.237067 0.397777
N  -3.562384 -0.11603 0.758629
C  0.883986 1.072553 -0.562179
C  2.265298 0.619687 -1.064171
C  0.004358 -0.130177 -0.16096
C  2.938314 -0.375808 -0.092693
C  1.970373 -1.525116 0.243831
C  -2.438092 -0.426187 0.001979
H  0.352982 1.704279 -1.292765
H  2.908131 1.496106 -1.253522
H  2.097635 0.121457 -2.044156
H  -0.207312 -0.708215 -1.090021
H  3.859934 -0.784426 -0.548851
H  3.224822 0.147563 0.836907
H  1.751445 -2.130552 -0.664354
H  2.373419 -2.189164 1.02539
H  -1.247972 0.857487 1.210061
H  -3.540328 0.475574 1.586255
H  -4.43812 -0.552021 0.482431
