program: Gaussian 09
title: 000224845
version: EM64L-G09RevD.01
frameworkgroup: C1[X(C9H7Br2ClO2)]
method: RPBEPBE
basis: SDD
operation: Freq
keyword: #p
keyword: freq=noraman
keyword: PBEPBE/SDD
title: #p freq=noraman PBEPBE/SDD
converged: YES YES NO NO
title: Mulliken charges:
elementType: Br Br Cl O O C C C C C C C C C H H H H H H H
charge: 0.011700 0.066458 -0.050471 -0.391339 -0.195250 -0.653170 0.614842 -0.541653 -0.267155 -0.406367 -0.111871 -0.202982 0.261120 -0.231368 0.352158 0.350909 0.255633 0.242749 0.240247 0.262827 0.392983
chargesum: 0.00000
title: Mulliken charges with hydrogens summed into heavy atoms:
elementType: Br Br Cl O O C C C C C C C C C
charge: 0.011700 0.066458 -0.050471 0.001644 -0.195250 -0.301012 0.614842 -0.190744 -0.011522 -0.163617 -0.111871 0.037266 0.261120 0.031459
polarizability: 1.73783905e+02 2.07310668e+01 1.39854536e+02 -3.86747426e+00 -1.14602619e+00 1.31055279e+02
1716.lowfreq: -5.9910 0.0019 0.0021 0.0024 3.2656 7.2315 18.4236 38.5859 49.2190
frequency: 18.1292 38.5239 49.2182 65.9453 90.0807 113.7078 139.8251 169.3856 182.0333 201.1265 229.7036 272.6157 324.0928 387.8248 428.4206 464.0593 515.2164 516.3262 545.6945 609.0238 623.3430 645.3656 677.5253 694.1433 723.2479 795.1488 861.8372 882.4254 905.7604 916.6553 982.3323 985.5473 1042.6510 1071.5971 1077.6605 1105.7325 1144.0719 1170.7693 1182.8342 1218.8735 1228.5325 1283.1899 1318.4678 1375.8855 1392.5613 1431.3119 1468.5640 1578.9521 1605.1004 1663.4380 3098.3229 3130.7587 3138.5212 3158.1474 3162.7389 3179.0391 3520.9948
redmass: 9.5223 9.7233 11.7222 9.7732 17.1609 12.5085 10.1841 18.5333 5.7768 10.4957 5.3288 7.8245 5.3868 12.0020 3.1676 4.6180 4.3724 3.9700 5.6146 4.7064 2.7238 2.0042 6.9251 2.0474 6.3292 1.4494 5.3001 1.6814 2.5717 1.7849 1.3559 5.8980 3.3745 2.0772 2.0551 1.7232 1.0947 1.2479 1.0982 1.4533 1.8136 1.3620 1.9287 3.4154 2.7195 2.3137 2.5104 6.3552 6.6647 9.2258 1.0873 1.0874 1.0883 1.0929 1.0924 1.0983 1.0642
irintensity: 0.4837 0.8781 0.4314 1.8831 0.4110 1.6890 3.1713 0.3929 0.6329 1.5930 2.7566 1.3100 0.7839 7.9192 0.7516 37.7807 27.3167 18.8055 64.4253 36.1856 89.2889 95.8981 22.2246 44.2273 9.6968 29.9941 25.6243 11.6875 6.6929 1.5861 0.2049 3.6350 195.7651 63.6526 21.5710 3.8216 17.4787 9.6635 0.7208 48.2490 38.9570 3.7153 21.1433 29.7973 34.8010 21.1521 13.5670 45.9492 3.5668 202.2218 0.6456 0.1856 3.6684 8.9438 1.2114 5.8375 48.6717
temp: 298.150 k
press: 1.00000 atm
elementType: 35 35 17 8 8 6 6 6 6 6 6 6 6 6 1 1 1 1 1 1 1
symmnumber: 1
zpe: 363682.7 jmol-1
zpe.correction: 0.138519 hartree
zpe.thermalcorrener: 0.152892 hartree
zpe.thermalcorrenthalpy: 0.153836 hartree
zpe.thermalcorrgfe: 0.092898 hartree
zpe.sumelectzpe: -983.573113 hartree
zpe.sumelectthermal: -983.558741 hartree
zpe.sumelectthermalent: -983.557797 hartree
zpe.sumelectthermalfe: -983.618735 hartree
dipole: -0.2695 -0.2471 0.7904
dipole: 0.8708
quadrupole: -99.2853 -113.6961 -101.7752
quadrupole: -2.2509 -15.2305 0.4387
quadrupole: 5.6336 -8.7772 3.1436 -2.2509 -15.2305 0.4387
hfenergy: -983.7116327 hartree
pointgroup: C01 [X(C9H7Br2Cl1O2)]
dipole: 0.1288402 -0.2882983 0.1329139 debye
dipolederiv: -0.3859861 0.0387411 -0.034819 0.1794389 -0.120791 0.0698801 -0.3624235 0.0493512 -0.8234724 -0.1940258 0.0067528 -0.0309614 0.0253342 -0.0638342 0.0189002 0.0382267 -0.0065241 -0.6511392 -0.3289878 -0.2668801 -0.065972 -0.3694649 -0.5975655 -0.1120207 -0.0745695 -0.0904127 -0.0853945 -0.7084314 0.5246407 0.0338424 0.4994932 -0.889476 -0.0262618 0.0446805 -0.0290427 -0.3710132 -0.7370906 -0.2055994 -0.083839 0.0153009 -0.8118768 -0.1340407 0.0039519 -0.1084123 -0.3201973 0.750495 -0.0663197 0.1500115 -0.2329672 0.0904205 -0.0934003 0.4075253 -0.1225625 0.8365986 -0.2043259 -0.0067469 -0.0445588 0.0615583 0.0853558 0.0192865 0.0718735 0.0124907 -0.0989566 -0.1684628 0.020677 -0.1381337 -0.0371301 0.0082502 -0.0410485 -0.2241392 -0.0547533 0.8277637 -0.1767341 -0.1934444 -0.0209481 -0.1141721 -0.2028059 0.0005435 -0.006004 -0.0464358 -0.0583145 -0.0867433 0.1039559 0.0264628 -0.0394981 0.0099056 -0.0089658 -0.0142846 0.0322279 -0.1386925 0.3815826 0.4948104 0.0940447 0.6541949 0.8907768 0.2092824 0.1361743 0.1624959 -0.0125355 0.0354108 -0.0553527 0.0237906 -0.1112322 0.0953713 -0.0143647 0.0337682 0.0028157 -0.1053031 1.3806382 -0.2250433 0.2407026 -0.3030489 1.3829228 0.2360894 0.1113628 0.1831088 0.254721 -0.0506883 -0.0798992 0.0005342 -0.1319358 -0.2479983 -0.0473731 -0.0017438 -0.0261666 -0.1068403 0.085976 -0.0000259 -0.019094 -0.0021254 0.011318 0.000983 -0.024793 0.0572636 -0.0334268 0.0869236 -0.0347246 -0.019501 -0.0376858 0.0222817 -0.0003239 0.0175411 0.0483394 -0.0396189 0.0806302 0.0743957 -0.012685 0.0851891 0.0166085 -0.0081914 -0.0248097 -0.0012624 0.1216806 0.0408959 -0.0981869 -0.0230474 -0.0719786 -0.0126683 -0.0255388 -0.0306718 -0.0260891 0.1275521 0.0241827 0.0692167 -0.0155986 0.080394 -0.0544015 -0.004021 -0.0141328 -0.0051444 0.1531305 -0.0305951 0.0000942 -0.0307396 -0.0112202 0.1053855 -0.007902 -0.0405694 -0.0046285 0.1536951 0.2053363 -0.1010615 -0.0294909 -0.1384441 0.2828206 -0.0315126 -0.0469631 -0.0266588 0.3697632 unknown
polarizability: 171.7393317|2.2740115|130.9674934|22.3956437|1.882296|141.9868946 unknown
InChI: InChI=1S/C9H7Br2ClO2/c10-7(8(11)9(13)14)5-2-1-3-6(12)4-5/h1-4,7-8,13H
charge 0 multiplicity 1
21 atoms
Br -1.175586 0.071405 -2.49232
Br -1.426146 0.04357 2.302021
Cl 3.612733 2.294262 0.474407
O  -3.90817 1.361198 0.168056
O  -3.717298 -0.936762 -0.170924
C  -0.816288 -0.508613 -0.51213
C  0.664561 -0.471764 -0.2579
C  -1.708572 0.424361 0.301155
C  1.351516 0.751367 -0.040382
C  1.388903 -1.690334 -0.248019
C  2.73554 0.722565 0.190493
C  2.780869 -1.692204 -0.013486
C  -3.195006 0.170652 0.065535
C  3.47151 -0.479982 0.209712
H  -1.223825 -1.531174 -0.49668
H  -1.467208 1.490287 0.19266
H  0.822617 1.708941 -0.062649
H  0.861471 -2.635214 -0.420085
H  3.334359 -2.636511 -0.002902
H  4.549818 -0.468339 0.391657
H  -4.880295 1.185991 0.042882
