program: Gaussian 09
title: 000224849
version: EM64L-G09RevD.01
frameworkgroup: C1[X(C17H14O2)]
method: RPBEPBE
basis: SDD
operation: Freq
keyword: #pfreq=noraman
keyword: PBEPBE/SDD
title: #p freq=noraman PBEPBE/SDD
converged: YES YES NO NO
title: Mulliken charges:
elementType: O O C C C C C C C C C C C C C C C C C H H H H H H H H H H H H H H
charge: -0.424747 -0.219502 -0.614748 -0.570008 -0.181623 -0.492331 0.413432 0.383038 0.405725 0.410788 0.147031 -0.482173 -0.470943 -0.478282 -0.465617 -0.237179 -0.234914 -0.234333 -0.233434 0.283497 0.248989 0.281572 0.277405 0.236068 0.245540 0.244469 0.242206 0.241467 0.225222 0.224456 0.225129 0.224414 0.379386
chargesum: 0.00000
title: Mulliken charges with hydrogens summed into heavy atoms:
elementType: O O C C C C C C C C C C C C C C C C C
charge: -0.045362 -0.219502 -0.331251 -0.321019 0.099949 0.021143 0.413432 0.383038 0.405725 0.410788 0.147031 -0.236633 -0.226473 -0.236077 -0.224150 -0.011957 -0.010458 -0.009204 -0.009020
polarizability: 2.09894727e+02 1.56344939e+01 1.53818692e+02 -7.31280422e+00 2.00716901e+01 1.60044108e+02
1716.lowfreq: -8.1024 -3.0024 -0.0005 -0.0005 0.0008 20.5529 42.0715 52.7786 66.8380
frequency: 42.0539 52.7423 66.8258 119.5103 140.9360 160.3775 172.5507 273.1134 295.7483 321.0318 347.9079 370.5337 400.1185 422.7219 452.0124 500.0261 503.2221 516.1922 570.3816 573.5755 593.7304 604.9708 625.5879 643.5094 677.8466 727.1161 751.4288 755.9268 759.7010 767.7033 789.6004 813.0978 822.6057 848.1496 877.2230 883.2694 892.9786 914.5327 944.0625 947.3820 960.0757 984.1814 985.7172 1005.7472 1018.1934 1024.4647 1029.8338 1079.7288 1091.3328 1116.9207 1144.2301 1166.5842 1171.1871 1171.8925 1173.4512 1189.3940 1198.3377 1206.2854 1214.0761 1220.2775 1246.1539 1265.1820 1281.7101 1299.5475 1320.7814 1329.3572 1347.9257 1393.5796 1396.6705 1444.9046 1452.2702 1464.5273 1470.2607 1483.6685 1594.2415 1600.4330 1613.6002 1622.0767 1661.7416 3012.0765 3021.6099 3053.7927 3081.2704 3082.5603 3118.9586 3119.7232 3125.2299 3126.2312 3139.4565 3140.1954 3159.8126 3160.4230 3517.1332
redmass: 8.8545 7.6967 5.0464 4.5306 3.9381 3.9026 5.0971 4.5791 5.1249 2.9767 4.1202 4.3227 4.3797 4.4437 3.3727 4.4914 4.6199 3.5656 3.9438 3.6093 2.8392 4.1097 1.9327 5.6616 3.8139 4.7791 2.2622 2.6303 1.8261 1.7676 3.5752 3.5982 2.6032 2.7343 1.3869 2.0913 3.4239 3.6700 1.4089 1.4415 3.1693 1.3205 1.3210 2.3443 3.0101 2.2206 2.7796 2.6686 2.0685 1.6838 1.1641 1.6967 1.0954 1.0759 2.8091 1.2258 1.4513 1.4432 1.8260 1.6725 1.5921 1.7568 1.7162 1.4273 1.5515 1.4159 1.7428 7.0316 6.3291 2.3896 2.4916 2.3551 1.2005 2.2924 6.2267 7.1630 6.9770 7.1676 8.8769 1.0717 1.0718 1.0874 1.0915 1.1013 1.0857 1.0855 1.0896 1.0895 1.0940 1.0942 1.1003 1.1003 1.0640
irintensity: 0.6399 0.5855 0.4008 0.2435 0.1186 0.1095 0.7480 0.3876 4.5696 0.3217 1.3151 0.0224 8.2561 3.4924 3.3031 2.1503 14.9739 2.1664 3.2068 70.8536 41.2695 6.6805 72.3082 1.5904 17.3740 6.8993 11.5765 21.4108 35.3724 71.4696 8.9935 0.8757 0.5685 4.0727 0.4102 2.9885 0.8116 14.8338 0.5756 3.6477 1.9394 0.0239 0.0853 10.1206 58.1025 7.6746 79.1745 143.1161 0.7244 2.5608 10.6789 1.4103 0.2694 0.4686 8.8571 1.3074 0.8591 2.6731 0.4359 3.7808 1.8455 10.6529 9.9854 0.8514 21.9936 0.4121 13.1688 0.1922 0.4239 11.3687 0.2425 36.1836 6.8919 14.6819 1.7815 0.0745 0.2407 0.1030 200.3897 10.0798 23.4502 31.8774 6.8297 14.7194 2.9352 4.6665 2.6918 2.6396 17.7337 42.7112 53.3862 21.4198 26.0640
temp: 298.150 k
press: 1.00000 atm
elementType: 8 8 6 6 6 6 6 6 6 6 6 6 6 6 6 6 6 6 6 1 1 1 1 1 1 1 1 1 1 1 1 1 1
symmnumber: 1
zpe: 689294.4 jmol-1
zpe.correction: 0.262538 hartree
zpe.thermalcorrener: 0.276738 hartree
zpe.thermalcorrenthalpy: 0.277683 hartree
zpe.thermalcorrgfe: 0.221094 hartree
zpe.sumelectzpe: -805.364384 hartree
zpe.sumelectthermal: -805.350184 hartree
zpe.sumelectthermalent: -805.349240 hartree
zpe.sumelectthermalfe: -805.405828 hartree
dipole: -0.8929 -0.3587 -0.7212
dipole: 1.2025
quadrupole: -106.5021 -105.2552 -104.0205
quadrupole: 1.1533 -8.8571 7.3265
quadrupole: -1.2428 0.0041 1.2387 1.1533 -8.8571 7.3265
hfenergy: -805.6269223 hartree
pointgroup: C01 [X(C17H14O2)]
dipole: -0.3614107 -0.1111798 -0.2843231 debye
polarizability: 211.4745924|12.4931916|150.9215649|-6.1248812|20.1019376|161.361369 unknown
InChI: InChI=1S/C17H14O2/c18-17(19)15-9-14-10-5-1-3-7-12(10)16(15)13-8-4-2-6-11(13)14/h1-8,14-16,18H,9H2
charge 0 multiplicity 1
33 atoms
O  1.932349 -2.958372 -0.976684
O  2.73535 -2.202204 1.06127
C  0.008768 -0.759062 -0.795171
C  -0.367112 0.45576 1.499347
C  0.375743 -1.740671 0.40494
C  0.170656 -1.002809 1.76451
C  -1.444379 -0.357828 -0.557632
C  0.878635 0.482907 -0.623271
C  -1.649201 0.306209 0.68311
C  0.671404 1.14491 0.617978
C  1.788691 -2.2865 0.250618
C  -2.526419 -0.596627 -1.425397
C  1.818118 0.977033 -1.547567
C  -2.937871 0.73277 1.054113
C  1.40623 2.302918 0.933653
C  -3.824458 -0.163985 -1.053894
C  2.553844 2.146555 -1.232259
C  -4.02872 0.497284 0.179425
C  2.348696 2.805708 0.002042
H  0.164513 -1.265065 -1.760591
H  -0.530969 0.98598 2.452789
H  -0.304868 -2.608979 0.320919
H  1.129263 -0.95124 2.308613
H  -0.554281 -1.549497 2.392099
H  -2.366652 -1.109441 -2.381222
H  1.975941 0.464502 -2.503717
H  -3.097277 1.246294 2.009705
H  1.250539 2.813242 1.891421
H  -4.672299 -0.339674 -1.725456
H  3.283336 2.542981 -1.947432
H  -5.034411 0.831599 0.458329
H  2.921028 3.70988 0.238301
H  2.862013 -3.307181 -1.04649
