program: Gaussian 09
title: 000224864
version: EM64L-G09RevD.01
frameworkgroup: C1[X(C14H30N4O2)]
method: RPBEPBE
basis: SDD
operation: Freq
keyword: #p
keyword: freq=noraman
keyword: PBEPBE/SDD
title: #p freq=noraman PBEPBE/SDD
converged: YES YES NO NO
title: Mulliken charges:
elementType: O O N N N N C C C C C C C C C C C C C C H H H H H H H H H H H H H H H H H H H H H H H H H H H H H H
charge: -0.278330 -0.278349 -0.086742 -0.086780 -0.318625 -0.318640 -0.344891 -0.344891 -0.311550 -0.388757 -0.311494 -0.388739 -0.385768 -0.385770 -0.697914 -0.683091 -0.697950 -0.683095 0.094647 0.094691 0.190388 0.244813 0.190377 0.244950 0.186333 0.202068 0.219921 0.223697 0.186309 0.202047 0.219887 0.223726 0.253427 0.222228 0.253417 0.222175 0.342675 0.342699 0.211678 0.216295 0.229284 0.217037 0.218282 0.222875 0.211675 0.216288 0.229288 0.217034 0.218273 0.222892
chargesum: 0.00000
title: Mulliken charges with hydrogens summed into heavy atoms:
elementType: O O N N N N C C C C C C C C C C C C C C
charge: -0.278330 -0.278349 -0.086742 -0.086780 0.024050 0.024059 0.090310 0.090436 0.076851 0.054862 0.076861 0.054873 0.089886 0.089822 -0.040656 -0.024896 -0.040700 -0.024896 0.094647 0.094691
polarizability: 2.58015814e+02 -2.94176530e-02 1.55608245e+02 1.19627648e+01 -4.88972031e-02 1.73617329e+02
1716.lowfreq: -0.0007 -0.0003 0.0008 2.8441 5.2335 9.9646 19.2605 19.6703 22.6724
frequency: 19.2177 19.6458 22.1730 29.9092 39.1879 51.6619 56.7354 61.4372 71.2725 77.1493 82.7671 105.5562 109.1484 155.2602 158.8367 166.8599 196.0514 214.6784 223.1120 243.4645 245.9585 270.7682 270.9690 288.4312 294.6828 297.2047 319.8231 382.5752 403.3264 407.8252 429.9559 477.0339 485.2465 490.8956 522.6543 523.3096 567.9637 705.5640 716.2262 724.4874 743.8947 745.6406 767.3945 771.1104 771.3152 782.8892 800.0674 803.9943 817.3064 861.8146 895.7335 900.3212 973.5758 974.7960 982.8286 1019.2238 1028.3360 1053.3736 1053.5341 1068.7291 1069.5919 1075.0138 1075.5782 1086.6104 1088.7210 1098.3894 1116.6806 1116.8220 1181.4141 1182.7434 1204.8173 1206.5591 1207.0967 1230.8191 1258.5122 1263.4329 1284.1122 1284.5828 1297.1442 1298.3985 1320.6744 1321.1172 1336.6092 1336.7706 1343.1087 1343.1907 1366.0055 1366.1904 1370.1558 1370.4549 1378.5807 1378.7030 1386.5077 1386.5329 1448.5415 1449.6286 1458.1104 1458.2872 1466.9596 1467.0711 1472.9510 1472.9887 1477.8942 1477.9769 1482.1971 1482.3427 1489.1641 1489.1796 1495.2190 1498.9894 1499.1199 1507.8224 1625.7099 1632.6859 2855.3935 2855.4764 2892.3786 2892.5753 2976.3940 2976.4373 2985.1779 2985.2078 2994.7837 2994.8218 3007.4921 3007.5852 3020.5196 3020.8804 3040.7066 3040.7346 3046.1541 3046.2219 3072.4045 3072.4263 3077.4526 3077.4740 3080.6764 3080.7099 3089.9935 3090.0355 3092.5052 3092.5689 3477.9844 3478.2853
redmass: 4.2389 3.1509 4.6189 4.5244 3.9480 3.4793 2.5366 2.5598 3.0260 3.0228 3.2015 3.7295 2.8848 2.9286 1.5898 1.6360 2.2488 1.1775 1.2537 2.3874 3.2000 1.7618 1.8874 3.1096 1.8508 2.1079 3.8558 3.4106 2.2375 2.5935 3.5741 3.0548 2.7998 5.7052 2.8466 6.2697 3.7910 1.5921 1.1103 1.4032 2.7734 2.3225 1.4630 1.1368 1.1470 9.7893 1.2099 1.1856 1.5512 2.6345 2.0105 2.0565 2.6728 2.4481 4.0255 4.1134 3.5662 2.4010 2.4436 2.0485 2.0246 1.9717 1.9297 2.3735 2.2082 3.6090 1.6543 1.6587 1.7566 1.8283 2.2582 2.0820 2.1363 2.1385 1.3600 1.3744 1.2532 1.2690 1.1323 1.1265 1.2729 1.2765 1.3299 1.3294 1.2228 1.2223 1.3364 1.3357 1.2981 1.2926 1.2444 1.2442 1.2462 1.2466 1.1062 1.0899 1.0648 1.0631 1.0507 1.0507 1.0512 1.0502 1.0628 1.0615 1.0610 1.0572 1.0767 1.0767 1.8868 1.0826 1.0848 2.2123 7.2243 9.4763 1.0717 1.0716 1.0701 1.0701 1.0349 1.0349 1.0361 1.0361 1.0610 1.0610 1.0860 1.0860 1.0607 1.0608 1.0977 1.0978 1.0930 1.0929 1.0989 1.0989 1.1000 1.1000 1.1001 1.1001 1.1005 1.1005 1.1058 1.1058 1.0765 1.0777
irintensity: 0.2946 0.0526 0.0614 0.1519 0.2423 0.1284 0.0021 0.5769 1.6072 0.1619 1.4927 5.8011 0.2407 15.2214 1.3647 0.1760 4.1411 0.0854 1.8604 2.3603 0.0015 0.9177 0.6329 0.6394 2.8747 2.1023 33.4088 30.4117 2.7537 0.9093 0.1156 4.7180 0.2279 6.4470 19.0390 30.5936 6.7606 9.7685 208.7517 0.0647 7.0573 12.3193 3.0749 10.6126 0.6507 1.3769 5.1939 5.6026 16.6375 0.0264 2.8949 2.9485 1.2550 15.0881 0.4963 9.1099 1.3337 7.6878 23.8384 60.1080 0.9483 3.9288 75.2776 7.8479 57.3094 9.7942 9.8190 3.2012 56.9373 7.7371 1.2653 11.5391 66.0736 0.6633 14.5736 0.0621 17.2588 3.5711 51.0379 0.2919 4.0928 5.0025 1.8624 0.0317 11.7055 10.6722 4.1020 2.6306 5.0278 19.6472 6.5409 33.5842 39.5218 10.0433 41.4164 7.8110 11.7249 26.7702 14.7958 9.7538 6.1018 2.2973 10.7748 3.6711 6.6373 1.6937 22.7937 5.9600 489.1828 1.7060 5.8906 0.2909 344.3491 1.4115 98.5632 80.6902 87.9497 66.3062 4.3099 50.3219 53.9828 2.3659 79.8489 10.7488 24.4791 23.7769 42.3646 25.9523 6.9983 1.8212 25.1006 8.7740 50.5345 38.4271 127.3810 15.9088 83.7053 5.4717 33.1992 51.5770 6.0511 27.9216 1.3890 109.5976
temp: 298.150 k
press: 1.00000 atm
elementType: 8 8 7 7 7 7 6 6 6 6 6 6 6 6 6 6 6 6 6 6 1 1 1 1 1 1 1 1 1 1 1 1 1 1 1 1 1 1 1 1 1 1 1 1 1 1 1 1 1 1
symmnumber: 1
zpe: 1152307.9 jmol-1
zpe.correction: 0.438891 hartree
zpe.thermalcorrener: 0.464149 hartree
zpe.thermalcorrenthalpy: 0.465093 hartree
zpe.thermalcorrgfe: 0.379187 hartree
zpe.sumelectzpe: -919.296384 hartree
zpe.sumelectthermal: -919.271126 hartree
zpe.sumelectthermalent: -919.270182 hartree
zpe.sumelectthermalfe: -919.356088 hartree
dipole: -0.0009 1.9893 0.0021
dipole: 1.9893
quadrupole: -104.6834 -126.3075 -127.2407
quadrupole: -0.0222 10.9882 0.0050
quadrupole: 14.7271 -6.8970 -7.8302 -0.0222 10.9882 0.0050
hfenergy: -919.7352753 hartree
pointgroup: C01 [X(C14H30N4O2)]
dipole: 0.0002947 -0.7826503 -0.0006611 debye
polarizability: 257.5058033|-0.0136654|155.6081259|-13.6342349|0.0159154|174.1274585 unknown
InChI: InChI=1S/C14H30N4O2/c1-5-17(6-2)11-9-15-13(19)14(20)16-10-12-18(7-3)8-4/h15-16H,5-12H2,1-4H3
charge 0 multiplicity 1
50 atoms
O  0.922504 0.815418 1.554647
O  -0.922942 0.814979 -1.551422
N  5.13339 -0.524536 0.072691
N  -5.133343 -0.523591 -0.073222
N  1.670994 0.861358 -0.676053
N  -1.67143 0.861646 0.679232
C  3.670925 -0.567489 -0.136801
C  -3.670972 -0.56667 0.137148
C  5.907567 -0.599803 -1.190615
C  5.626719 -1.37102 1.186562
C  -5.908375 -0.600361 1.189436
C  -5.625973 -1.368967 -1.188259
C  3.110573 0.861852 -0.382046
C  -3.111004 0.862341 0.385089
C  7.373618 -0.153425 -1.03733
C  5.556642 -2.907328 0.963923
C  -7.374479 -0.154453 1.035302
C  -5.554869 -2.905523 -0.967657
C  0.714276 0.831418 0.296718
C  -0.7147 0.831356 -0.293495
H  3.377906 -1.22846 -0.987398
H  3.179955 -0.969977 0.767591
H  -3.378286 -1.229003 0.986807
H  -3.179405 -0.967484 -0.767652
H  5.87591 -1.623682 -1.643059
H  5.412349 0.07118 -1.919015
H  6.670897 -1.081132 1.406146
H  5.038517 -1.105804 2.085386
H  -5.876707 -1.624698 1.640821
H  -5.413972 0.070065 1.918902
H  -6.670332 -1.079485 -1.407598
H  -5.037803 -1.102195 -2.086637
H  3.287873 1.461913 0.526521
H  3.642701 1.341515 -1.222573
H  -3.288492 1.464014 -0.522385
H  -3.643246 1.340346 1.226483
H  1.313958 0.854074 -1.639202
H  -1.31444 0.854764 1.642396
H  7.866258 -0.1177 -2.026363
H  7.954495 -0.846564 -0.402599
H  7.419991 0.851926 -0.582685
H  5.917611 -3.43931 1.863968
H  6.183679 -3.22646 0.111309
H  4.519363 -3.237371 0.769341
H  -7.868082 -0.120137 2.023909
H  -7.954444 -0.847069 0.399156
H  -7.420838 0.851418 0.581817
H  -5.915253 -3.436535 -1.868508
H  -6.181884 -3.226262 -0.115636
H  -4.517398 -3.235089 -0.773288
