program: Gaussian 09
title: 000224870
version: EM64L-G09RevD.01
frameworkgroup: C1[X(C20H21N3O)]
method: RPBEPBE
basis: SDD
operation: Freq
keyword: #p
keyword: freq=noraman
keyword: PBEPBE/SDD
title: #p freq=noraman PBEPBE/SDD
converged: YES YES NO NO
title: Mulliken charges:
elementType: O N N N C C C C C C C C C C C C C C C C C C C C H H H H H H H H H H H H H H H H H H H H H
charge: -0.262773 -0.045150 -0.150455 -0.312645 -0.631468 0.158328 0.408157 0.003106 0.477315 -0.131167 0.407602 -0.324966 -0.321273 -0.406802 -0.381655 -0.391405 -0.388334 -0.543548 -0.316299 0.308046 -0.344759 -0.646157 -0.645558 -0.537149 0.247130 0.245054 0.275191 0.237673 0.283096 0.212957 0.237901 0.236189 0.245625 0.261173 0.254317 0.217050 0.237656 0.237153 0.235087 0.236211 0.217946 0.209905 0.246106 0.222544 0.223046
chargesum: 0.00000
title: Mulliken charges with hydrogens summed into heavy atoms:
elementType: O N N N C C C C C C C C C C C C C C C C C C C C
charge: -0.262773 -0.045150 -0.150455 -0.102740 -0.139285 0.158328 0.408157 0.003106 0.477315 -0.131167 0.407602 -0.049775 -0.083599 -0.123707 -0.168697 -0.153505 -0.152145 -0.297923 -0.055126 0.308046 -0.090442 0.045702 0.043686 0.154548
polarizability: 3.42867070e+02 1.05466468e+01 2.88412377e+02 4.45071485e+00 -2.72228781e+01 1.67824297e+02
1716.lowfreq: -13.3024 -5.8089 -3.2580 -0.0006 -0.0005 0.0001 14.5274 22.3863 34.6714
frequency: 14.4071 22.3001 34.6669 47.5450 66.0380 79.8680 91.6644 112.1153 117.7805 134.9395 169.1074 176.9697 190.0255 202.8162 207.8021 231.2870 247.9966 280.3684 301.8942 309.0778 363.7840 388.8010 403.0919 408.8231 417.8922 434.8161 458.3725 483.0233 485.6331 492.5659 509.3947 527.3945 533.4280 572.1286 578.8768 631.8871 636.2549 656.9747 667.5290 719.6567 730.1669 758.7341 773.4988 792.8944 804.9035 813.7062 824.5236 840.0960 847.3385 880.3742 884.0313 908.2341 937.7628 941.9231 946.6425 970.4558 975.9361 976.8591 983.3471 990.1881 994.3100 1004.1207 1056.0589 1107.4758 1108.5075 1110.4605 1113.9138 1136.1953 1143.8880 1157.2905 1158.9599 1166.1481 1179.9265 1188.6028 1217.6354 1223.5270 1259.5127 1260.0262 1262.5383 1280.6155 1296.5273 1327.7416 1341.7952 1358.7677 1368.7575 1374.2710 1398.5490 1414.8353 1428.0862 1433.3337 1445.0496 1457.7077 1463.8397 1464.5180 1465.7342 1471.6626 1474.8697 1475.6858 1491.9888 1499.4017 1505.9559 1532.3702 1538.4228 1556.5463 1572.2005 1594.0552 1627.0376 1631.5383 2941.5792 2949.5528 2959.3711 3008.0021 3011.6889 3025.3022 3047.0488 3096.0125 3096.6212 3106.1909 3111.2360 3124.1666 3126.7032 3130.0674 3143.2804 3152.0980 3160.8197 3161.3200 3165.2601 3174.3935 3286.1885
redmass: 4.9265 4.4490 3.2304 4.7322 4.1333 2.4966 3.9460 1.7494 4.3862 4.2748 3.2035 2.8149 2.0551 1.2629 2.9110 2.8676 1.7284 3.5169 3.6764 3.8391 4.4308 4.4570 4.5223 4.0748 2.9094 2.7548 3.6510 3.2040 3.8426 3.5507 3.4855 3.8271 3.7696 3.9392 3.5931 6.3557 5.9492 3.9166 4.0638 3.7462 4.1433 4.6946 3.5034 2.1275 1.5049 2.2725 1.6152 1.9492 2.3796 1.7187 1.4777 3.3424 3.5723 2.8217 1.4839 2.4183 1.3846 1.7830 1.8723 1.4924 4.4227 2.1795 1.4990 1.2377 1.6131 1.3237 1.2634 1.3973 1.3241 1.3449 1.5229 1.4918 1.8014 1.7940 1.3385 1.7238 3.8327 2.8869 1.5015 1.8891 2.0771 1.4438 2.2441 3.5106 2.9627 4.8280 3.0732 6.6741 1.3259 1.2272 2.4559 1.1798 1.1303 1.0680 1.0497 1.1567 2.4006 1.0465 1.0984 3.5407 1.1105 2.6416 5.9542 7.6850 6.7737 6.4882 6.5819 6.0034 1.0367 1.0392 1.0330 1.0998 1.1025 1.0598 1.1039 1.0964 1.1022 1.0943 1.0881 1.0897 1.0992 1.0907 1.0912 1.0876 1.0969 1.0925 1.0936 1.0980 1.0741
irintensity: 1.5340 2.5616 1.2965 1.5112 0.4192 0.3501 2.9476 3.3136 1.0171 0.6930 1.0839 1.3222 4.2040 0.7469 8.8546 1.0140 0.9347 5.0861 3.3324 0.9117 0.6637 3.8808 4.2311 1.2684 1.3619 3.8441 12.4679 3.9342 5.5058 1.8777 17.5827 9.2439 11.6139 3.9465 2.1443 1.2441 0.2531 0.2305 6.1985 14.7478 2.7936 1.6969 3.7999 7.8953 15.7257 8.5136 51.1958 85.0502 17.8263 67.8983 50.0594 6.5895 5.7515 20.8430 8.0091 16.0845 0.7833 8.0974 9.0135 0.1064 52.7930 12.1671 23.8761 0.0912 23.1073 1.0573 0.1931 9.3200 4.6770 0.7485 36.4931 15.8245 155.1295 56.6651 80.7440 16.9252 123.6840 19.2882 3.6805 51.6549 5.8921 38.8558 136.5465 55.1623 112.6098 120.9888 1.4005 19.0217 9.6286 6.8987 7.2111 23.0921 15.3696 1.7993 13.0960 82.3069 4.4479 22.7986 6.9464 78.2216 54.8073 197.9821 29.3142 27.0793 77.2150 95.3917 79.8521 312.8426 102.9771 104.4597 63.6602 13.2981 71.4663 12.0761 47.4794 4.2176 9.3791 47.4793 9.5648 11.2554 30.9994 4.5254 16.0259 1.0494 5.0721 19.8082 18.2753 9.1394 58.0748
temp: 298.150 k
press: 1.00000 atm
elementType: 8 7 7 7 6 6 6 6 6 6 6 6 6 6 6 6 6 6 6 6 6 6 6 6 1 1 1 1 1 1 1 1 1 1 1 1 1 1 1 1 1 1 1 1 1
symmnumber: 1
zpe: 957661.4 jmol-1
zpe.correction: 0.364754 hartree
zpe.thermalcorrener: 0.386902 hartree
zpe.thermalcorrenthalpy: 0.387846 hartree
zpe.thermalcorrgfe: 0.311305 hartree
zpe.sumelectzpe: -1012.469252 hartree
zpe.sumelectthermal: -1012.447104 hartree
zpe.sumelectthermalent: -1012.446160 hartree
zpe.sumelectthermalfe: -1012.522701 hartree
dipole: 1.5880 -4.0096 -2.7857
dipole: 5.1341
quadrupole: -95.3778 -142.1942 -138.0537
quadrupole: -16.1305 7.5496 -3.7650
quadrupole: 29.8307 -16.9856 -12.8451 -16.1305 7.5496 -3.7650
hfenergy: -1012.8340057 hartree
pointgroup: C01 [X(C20H21N3O1)]
dipole: -0.4600231 1.7518847 -0.8940046 debye
polarizability: 343.8113932|4.4385905|277.6770127|7.3338588|42.6836859|177.6153379 unknown
InChI: InChI=1S/C20H21N3O/c1-23(2)17-8-5-14(6-9-17)19(21)13-16-7-4-15-12-18(24-3)10-11-20(15)22-16/h4-12,21H,13H2,1-3H3
charge 0 multiplicity 1
45 atoms
O  6.078638 1.757526 0.140565
N  1.196098 -0.831708 1.216757
N  -4.819713 2.519157 -0.233395
N  -1.739549 -3.298151 -1.132172
C  -0.575282 -2.498584 0.824699
C  0.751333 -1.848145 0.445414
C  -2.468579 -1.067091 -0.237183
C  -1.649704 -2.314551 -0.25509
C  3.210971 -0.661766 -0.235565
C  2.409712 -0.239752 0.893704
C  -4.05445 1.35183 -0.233439
C  1.480448 -2.327796 -0.696784
C  2.698067 -1.738859 -1.032474
C  -2.088113 0.068988 0.533152
C  -3.670898 -0.962254 -0.993201
C  -2.849589 1.248376 0.53386
C  -4.448274 0.204005 -0.998235
C  4.45386 -0.008382 -0.515012
C  2.888963 0.834409 1.713616
C  4.886426 1.038668 0.30901
C  4.098459 1.46125 1.431076
C  -4.399765 3.673516 0.572265
C  -6.050103 2.59546 -1.031686
C  6.935924 1.38135 -0.985519
H  -0.424712 -3.587354 0.928496
H  -0.89979 -2.09024 1.795047
H  1.048234 -3.143481 -1.284663
H  3.269265 -2.090842 -1.899989
H  -1.166019 0.041052 1.124885
H  -4.024584 -1.821558 -1.577733
H  -2.50306 2.09495 1.132946
H  -5.370446 0.221878 -1.585892
H  5.043798 -0.344413 -1.374241
H  2.274452 1.139258 2.566092
H  4.479982 2.281513 2.046597
H  -5.128826 4.490061 0.451259
H  -3.406315 4.054005 0.259156
H  -4.34383 3.423044 1.651043
H  -6.79936 1.84383 -0.709085
H  -5.850368 2.436718 -2.110779
H  -6.500871 3.59343 -0.914963
H  -2.443801 -3.107412 -1.878532
H  7.797794 2.062337 -0.93303
H  6.4104 1.515446 -1.951204
H  7.280781 0.332879 -0.893771
