program: Gaussian 09
title: 000224850
version: EM64L-G09RevD.01
frameworkgroup: C1[X(C20H18O2)]
method: RPBEPBE
basis: SDD
operation: Freq
keyword: #pfreq=noraman
keyword: PBEPBE/SDD
title: #p freq=noraman PBEPBE/SDD
converged: YES YES NO NO
title: Mulliken charges:
elementType: O O C C C C C C C C C C C C C C C C C C C C H H H H H H H H H H H H H H H H H H
charge: -0.467524 -0.300518 -0.006670 -0.435395 0.371220 0.387163 -0.400387 -0.358563 -0.392806 -0.394960 -0.222935 -0.234835 -0.234995 -0.250241 0.397893 -0.242331 -0.241701 -0.342426 -0.391026 -0.224682 -0.197835 -0.255046 0.220050 0.262146 0.287173 0.264820 0.252396 0.241115 0.362129 0.225951 0.225736 0.225848 0.225210 0.227727 0.227930 0.255384 0.251330 0.225419 0.228799 0.229438
chargesum: 0.00000
title: Mulliken charges with hydrogens summed into heavy atoms:
elementType: O O C C C C C C C C C C C C C C C C C C C C
charge: -0.105396 -0.300518 -0.006670 0.046801 0.371220 0.387163 -0.113214 -0.093743 -0.140410 -0.153845 0.003016 -0.009100 -0.009147 -0.025032 0.397893 -0.014605 -0.013771 -0.087042 -0.139696 0.000737 0.030965 -0.025608
polarizability: 2.53858817e+02 1.31931830e+01 2.24661474e+02 -5.36438853e+00 1.67205712e+00 1.66180332e+02
1716.lowfreq: -6.3995 -0.8476 -0.0005 -0.0001 0.0004 5.1692 25.7233 29.8007 38.0130
frequency: 25.7138 29.6009 37.9840 39.0055 47.9311 61.6382 115.8076 138.9884 181.1679 206.7071 223.6293 235.2134 240.8448 283.0285 332.3359 349.0778 397.8199 403.6432 411.9766 415.5586 426.2118 454.6259 497.5917 501.4702 543.3274 556.9254 607.3909 610.5826 616.4524 616.5761 649.9467 691.3205 700.8785 706.7921 717.1186 757.1769 765.2641 774.6148 791.3106 824.1561 849.5890 861.8389 871.5725 891.4627 901.2169 928.0887 935.5601 962.8865 972.9996 976.5709 983.9498 985.6914 987.2084 990.3413 990.9896 996.1541 1000.7543 1022.5174 1023.0245 1027.1554 1048.5788 1066.6742 1083.1878 1083.8632 1108.2205 1156.2184 1167.9523 1171.8878 1172.5386 1178.7910 1183.8704 1188.0508 1193.6847 1214.9789 1262.2082 1305.5737 1315.0388 1320.3573 1321.9135 1357.5147 1380.8450 1382.6429 1388.2940 1434.3462 1436.6487 1443.1091 1461.8265 1479.5070 1480.6914 1482.8564 1591.4215 1592.6565 1593.1981 1610.1608 1610.8951 1613.6981 2979.0728 3045.0065 3121.9724 3124.0461 3130.0659 3130.0887 3133.9817 3138.5274 3142.9228 3148.0019 3156.1920 3156.3878 3159.0873 3164.0194 3167.1318 3173.5838 3175.4157 3531.5462
redmass: 5.1578 3.8146 3.8741 4.0822 4.7687 5.0616 5.3771 4.7138 5.0037 4.9488 4.3628 4.5323 4.5639 4.9748 4.9690 2.7760 2.7512 2.8771 2.9806 4.4119 1.6279 2.1623 4.2733 3.0143 4.3553 4.3866 5.0966 6.1081 6.3807 6.3901 5.6594 2.1376 1.6617 2.0660 3.5659 1.6100 1.8952 2.1010 5.0433 1.2642 1.2561 1.2748 2.8093 1.5116 2.1475 1.8266 1.5562 1.3649 2.2469 2.2797 1.3013 1.4213 5.7262 5.4795 5.6201 1.3391 1.3327 2.6208 2.1173 2.1464 2.0748 2.4895 1.5666 1.5401 2.0222 1.9913 1.0931 1.0772 1.0591 1.2249 1.4274 1.1644 1.1294 3.0250 2.1336 1.4902 1.3324 1.3222 1.3578 1.4686 8.3283 9.0373 6.5274 2.2056 2.2289 2.3070 1.1879 2.2797 2.0065 2.1487 6.2286 6.2078 6.3933 6.0664 6.2691 6.0436 1.0556 1.1073 1.0848 1.0845 1.0849 1.0885 1.0881 1.0890 1.0939 1.0925 1.0927 1.0953 1.0986 1.0957 1.1009 1.1009 1.0960 1.0651
irintensity: 0.0435 0.0260 0.0901 0.1087 0.0107 0.3406 1.0399 1.3017 2.8525 0.6890 1.4930 3.4269 1.3177 2.5511 2.4336 10.1378 1.3567 0.4061 0.9972 1.5351 124.7564 71.0634 5.9995 7.9856 11.0484 4.6652 33.5008 7.2855 1.3575 0.2973 27.1582 28.3103 61.6037 43.6121 25.3478 90.5124 49.5762 14.6455 50.5367 1.0726 0.3977 0.4230 8.0634 4.4671 43.2544 18.9340 9.7322 0.0879 25.7236 19.2410 0.6511 0.0423 19.3836 0.2010 0.2084 0.8912 1.4067 12.4429 26.0681 14.4367 21.3988 8.0052 6.2964 6.8372 6.3810 44.2502 15.4468 3.0674 0.5580 64.4589 8.2272 9.9077 6.4578 257.1751 23.4697 16.8351 0.8550 3.0867 33.3520 9.2592 1.9957 1.1548 10.4849 14.3782 12.7399 4.2842 95.1248 13.1099 78.9815 11.8116 0.4325 1.5742 29.1227 8.4243 88.7997 0.3635 27.6846 22.6521 1.3545 0.5021 3.5864 4.8113 6.5727 10.7963 31.7509 30.2816 48.0001 16.6926 27.4798 18.4432 14.0309 7.1659 8.7173 19.9396
temp: 298.150 k
press: 1.00000 atm
elementType: 8 8 6 6 6 6 6 6 6 6 6 6 6 6 6 6 6 6 6 6 6 6 1 1 1 1 1 1 1 1 1 1 1 1 1 1 1 1 1 1
symmnumber: 1
zpe: 842218.4 jmol-1
zpe.correction: 0.320784 hartree
zpe.thermalcorrener: 0.339501 hartree
zpe.thermalcorrenthalpy: 0.340445 hartree
zpe.thermalcorrgfe: 0.271507 hartree
zpe.sumelectzpe: -921.815058 hartree
zpe.sumelectthermal: -921.796341 hartree
zpe.sumelectthermalent: -921.795397 hartree
zpe.sumelectthermalfe: -921.864335 hartree
dipole: 0.6916 -0.2366 -1.5834
dipole: 1.7440
quadrupole: -119.5012 -118.9211 -126.1571
quadrupole: 0.8991 1.0050 2.2873
quadrupole: 2.0253 2.6054 -4.6306 0.8991 1.0050 2.2873
hfenergy: -922.1358421 hartree
pointgroup: C01 [X(C20H18O2)]
dipole: 0.3698646 0.2678069 0.5121092 debye
polarizability: 255.6323499|-10.6197075|220.0589948|-10.0114867|-9.4929676|169.0092782 unknown
InChI: InChI=1S/C20H18O2/c21-20(17-10-4-1-5-11-17,18-12-6-2-7-13-18)16-22-19-14-8-3-9-15-19/h1-15,21H,16H2
charge 0 multiplicity 1
40 atoms
O  -1.099869 -0.365386 -1.810829
O  1.454875 -0.079966 -0.779994
C  -0.933112 -0.09178 -0.36528
C  0.368942 0.727479 -0.199143
C  -2.09965 0.824691 0.048394
C  -0.944215 -1.422596 0.412026
C  -2.795141 1.580794 -0.926423
C  -1.986861 -2.342072 0.124105
C  -2.440568 0.973361 1.416049
C  0.012291 -1.762549 1.398419
C  -3.822554 2.469384 -0.536655
C  -2.072879 -3.571441 0.808924
C  -3.461549 1.868669 1.804683
C  -0.072248 -2.995617 2.08685
C  2.745028 0.482375 -0.828982
C  -4.156093 2.62089 0.829042
C  -1.114556 -3.903149 1.796948
C  3.065225 1.775727 -0.348477
C  3.745619 -0.342435 -1.399124
C  4.399503 2.235964 -0.44794
C  5.069176 0.131705 -1.489959
C  5.405314 1.424036 -1.015677
H  0.579142 0.95723 0.8637
H  0.260501 1.673295 -0.763433
H  -2.535379 1.445352 -1.979842
H  -2.720243 -2.081168 -0.646121
H  -1.924853 0.372672 2.174308
H  0.843275 -1.086827 1.62323
H  -0.263173 -0.810231 -2.109457
H  -4.362793 3.042521 -1.298812
H  -2.883821 -4.270579 0.575341
H  -3.719878 1.972634 2.864552
H  0.679599 -3.247244 2.843403
H  -4.952225 3.311451 1.129635
H  -1.178956 -4.858179 2.330534
H  2.302096 2.42245 0.094163
H  3.468706 -1.339222 -1.756228
H  4.647229 3.237132 -0.077632
H  5.840516 -0.509025 -1.931509
H  6.434979 1.789053 -1.088394
