program: Gaussian 09
title: 000224872
version: EM64L-G09RevD.01
frameworkgroup: C1[X(C22H27N3O)]
method: RPBEPBE
basis: SDD
operation: Freq
keyword: #p
keyword: freq=noraman
keyword: PBEPBE/SDD
title: #p freq=noraman PBEPBE/SDD
converged: YES YES NO NO
title: Mulliken charges:
elementType: O N N N C C C C C C C C C C C C C C C C C C C C C C H H H H H H H H H H H H H H H H H H H H H H H H H H H
charge: -0.272231 -0.159313 -0.434327 -0.059584 0.448024 0.390980 -0.498886 0.375211 -0.397156 -0.398571 0.323765 -0.371147 -0.371202 -0.433476 -0.402275 -0.102873 -0.469186 -0.497982 0.133689 -0.662151 -0.661538 -0.340441 0.292792 -0.357387 -0.799029 -0.536714 0.221751 0.222947 0.223409 0.220894 0.224072 0.221385 0.326601 0.227328 0.227274 0.230086 0.236369 0.241285 0.218875 0.217371 0.239735 0.214225 0.216896 0.239282 0.214520 0.257667 0.241944 0.222111 0.221510 0.250921 0.242041 0.220269 0.220238
chargesum: 0.00000
title: Mulliken charges with hydrogens summed into heavy atoms:
elementType: O N N N C C C C C C C C C C C C C C C C C C C C C C
charge: -0.272231 -0.159313 -0.107726 -0.059584 0.448024 0.390980 -0.054188 0.375211 0.047147 0.046887 0.323765 -0.143819 -0.143928 -0.203390 -0.165906 -0.102873 -0.227900 -0.279107 0.133689 0.009180 0.009160 -0.082775 0.292792 -0.115444 -0.104486 0.145834
polarizability: 3.84100075e+02 -2.15340156e+01 3.07917844e+02 3.16544301e+00 5.33533475e+00 1.85853336e+02
1716.lowfreq: -17.2228 -3.9146 0.0001 0.0004 0.0008 2.6772 6.2142 18.2488 19.8649
frequency: -15.8177 17.9313 19.7979 52.5916 56.4517 60.1467 64.8738 72.3512 86.5698 99.1367 103.1905 111.8881 151.1640 174.0978 176.7421 191.1096 199.6551 206.3614 214.6499 252.4203 255.9277 257.6809 288.9317 312.4428 323.9479 344.1624 367.7865 378.9323 392.7670 393.8738 421.6684 427.5083 450.6814 481.7298 503.6867 508.9163 524.3678 533.7450 547.5718 558.0735 595.3065 616.2500 621.9959 637.3068 675.8854 681.1645 713.3056 736.4697 769.2340 781.1428 784.0808 800.9957 806.7177 810.1849 825.7659 834.5687 845.3073 855.7320 888.0757 891.2326 920.1537 936.2729 951.9618 961.1654 971.6796 981.9946 991.4793 998.8362 1010.4782 1013.4595 1040.3521 1043.3000 1072.2977 1077.6564 1094.0661 1112.2609 1114.6133 1129.9720 1133.4759 1159.6718 1161.5165 1196.8298 1200.6748 1203.5251 1205.2704 1211.5051 1233.8673 1253.7999 1266.3469 1279.1321 1286.3103 1308.5472 1323.2669 1339.9332 1343.3844 1348.8955 1376.3283 1379.9771 1382.5244 1387.6982 1393.4165 1399.7176 1400.3649 1414.0823 1432.7666 1435.6348 1441.2711 1458.9816 1465.1334 1468.0046 1468.0920 1468.2713 1474.4869 1475.0408 1481.7807 1483.9243 1490.7489 1492.2554 1504.2392 1529.7223 1535.2321 1551.7293 1564.0365 1590.7582 1633.3120 1634.0313 2935.6363 2957.8972 2976.1036 2976.1965 2982.3855 2983.1235 2986.5364 2992.1686 3034.9803 3041.1217 3044.8041 3052.7014 3078.6445 3079.2258 3090.6455 3091.9056 3113.5393 3116.8216 3119.6013 3121.0513 3134.1377 3148.8438 3158.1777 3159.5960 3164.4677 3170.8374 3582.0211
redmass: 3.4587 4.4337 4.6702 2.8886 1.8909 3.6884 2.5109 1.8659 2.7449 3.5584 3.7648 4.0930 4.0141 3.3238 3.4495 2.7711 1.3537 2.4076 1.1115 2.2651 2.8585 1.5056 3.0825 2.9809 4.4601 2.3312 1.7467 3.1418 3.6884 3.3013 3.1478 3.7699 2.4253 4.6455 2.7040 3.2983 4.1690 3.8108 2.7996 3.2707 5.0346 4.4601 4.6948 6.7557 3.6152 3.9702 4.4219 4.2202 2.1646 1.1840 1.2139 3.6077 1.2905 2.1578 1.7212 3.4391 1.4957 1.9474 4.2792 2.3240 2.1303 1.3827 1.3498 1.3445 1.6258 4.5954 2.0494 2.9928 3.7909 2.9627 3.3263 1.5729 2.1343 1.8069 1.6669 1.2667 2.4955 1.5412 1.4768 1.9719 1.4260 1.7000 1.1715 2.0061 1.2204 3.1057 2.1401 1.5718 1.3917 3.8346 1.2159 1.5890 1.3315 1.3230 1.9448 1.3872 3.6669 1.2581 1.2648 1.2421 5.0068 2.1001 3.4262 2.3678 3.5313 1.5306 1.9715 1.3008 1.0455 1.0444 1.0502 1.0481 1.1309 1.0579 1.0514 1.5870 1.0800 1.2884 1.1716 2.6554 4.3081 4.6789 6.5325 6.4720 6.7196 6.2734 1.0576 1.0329 1.1023 1.0390 1.0355 1.0357 1.0601 1.0608 1.1028 1.1020 1.1039 1.0972 1.0996 1.0995 1.1010 1.1008 1.0978 1.0894 1.0893 1.0992 1.0901 1.0869 1.0907 1.0926 1.0936 1.0967 1.0770
irintensity: 0.0185 0.1554 0.1103 0.0907 0.8267 0.7260 3.9283 1.3790 1.0411 0.2172 1.3127 0.3821 0.4036 1.8624 2.2012 0.2095 0.8779 2.8088 0.3972 6.5467 1.9435 2.2079 2.3979 2.4993 0.7741 11.1935 23.4469 6.5588 5.6165 3.1841 3.6102 5.0275 19.8047 1.2451 12.2948 6.8633 3.0060 3.3458 9.0807 19.8666 7.7180 0.5272 2.4703 0.1515 2.0185 1.7405 15.4471 8.8836 0.7256 10.5101 8.4726 22.9946 0.3684 47.4670 34.9544 10.2662 38.8615 25.3690 0.4039 0.1939 4.5930 1.6436 0.4073 1.1149 2.2642 17.5405 6.2206 1.0693 76.4195 25.1224 0.8026 5.5853 14.0079 23.9976 18.2643 1.5239 78.2368 11.8938 0.7336 23.6034 3.2223 21.3248 39.8224 39.2994 26.8282 176.7938 12.3278 43.1659 84.5515 16.4033 3.2760 6.0972 1.5231 23.9747 86.2362 64.2316 9.7130 23.8454 12.2203 27.3932 65.6926 72.1389 22.6254 90.2920 5.2488 27.0828 30.3287 9.1872 7.3961 8.7629 13.5044 14.8333 92.0267 1.8244 2.4089 116.9648 29.3950 21.3841 8.5530 297.4899 230.2441 256.0130 6.9602 324.2004 94.7905 135.1413 50.3271 93.7992 26.8791 37.9228 31.2821 26.2429 55.8908 44.4288 6.0801 19.4360 49.7627 24.2684 35.5945 55.5193 4.9884 89.8832 13.2861 9.9707 23.9809 26.8979 10.9278 4.2400 24.7137 28.2988 12.1454 17.5480 48.9405
temp: 298.150 k
press: 1.00000 atm
elementType: 8 7 7 7 6 6 6 6 6 6 6 6 6 6 6 6 6 6 6 6 6 6 6 6 6 6 1 1 1 1 1 1 1 1 1 1 1 1 1 1 1 1 1 1 1 1 1 1 1 1 1 1 1
symmnumber: 1
zpe: 1161220.7 jmol-1
zpe.correction: 0.442286 hartree
zpe.thermalcorrener: 0.467590 hartree
zpe.thermalcorrenthalpy: 0.468534 hartree
zpe.thermalcorrgfe: 0.385622 hartree
zpe.sumelectzpe: -1092.111478 hartree
zpe.sumelectthermal: -1092.086174 hartree
zpe.sumelectthermalent: -1092.085229 hartree
zpe.sumelectthermalfe: -1092.168141 hartree
dipole: -6.5000 2.7221 0.0001
dipole: 7.0470
quadrupole: -137.7956 -141.2914 -152.6970
quadrupole: 10.8740 0.5937 2.3227
quadrupole: 6.1324 2.6366 -8.7690 10.8740 0.5937 2.3227
hfenergy: -1092.5537635 hartree
pointgroup: C01 [X(C22H27N3O1)]
dipole: 2.5261551 1.1416803 -0.0431598 debye
polarizability: 382.7218674|24.0225958|308.0070159|4.2221703|-12.9554534|187.1423717 unknown
InChI: InChI=1S/C22H27N3O/c1-5-25(6-2)18-9-7-17(8-10-18)15-23-22-13-16(3)24-21-12-11-19(26-4)14-20(21)22/h7-14,23H,5-6,15H2,1-4H3
charge 0 multiplicity 1
53 atoms
O  -3.179165 3.627409 -0.369953
N  5.606479 0.554732 -0.003126
N  -0.707211 -0.853941 0.178537
N  -4.89129 -1.742669 0.02296
C  4.339638 -0.037862 0.079198
C  1.723382 -1.263386 0.247103
C  0.340532 -1.882496 0.331472
C  -2.060332 -1.135123 0.131371
C  6.442485 0.76085 1.195569
C  6.171126 0.998656 -1.292573
C  -3.032965 -0.058152 -0.024117
C  3.753714 -0.38401 1.340533
C  3.571229 -0.329713 -1.096063
C  2.481972 -0.98346 1.410078
C  2.298764 -0.921347 -1.003263
C  -4.430396 -0.430385 -0.069172
C  -2.555101 -2.452478 0.226937
C  -2.67325 1.31527 -0.131075
C  -3.961568 -2.712779 0.166692
C  6.13689 2.078267 1.94806
C  6.922282 -0.117438 -2.058211
C  -5.403909 0.603848 -0.21701
C  -3.656779 2.305839 -0.274753
C  -5.040358 1.950108 -0.318126
C  -4.464916 -4.140203 0.272521
C  -4.167369 4.696444 -0.518136
H  0.210826 -2.64782 -0.462759
H  0.216219 -2.40664 1.303142
H  6.332201 -0.102883 1.877967
H  7.500971 0.760744 0.873203
H  5.367012 1.419992 -1.924302
H  6.867165 1.834232 -1.08783
H  -0.387853 0.113073 0.149424
H  4.283988 -0.176606 2.274118
H  3.97409 -0.112797 -2.089185
H  2.067632 -1.232447 2.395351
H  1.744081 -1.133136 -1.926217
H  -1.872701 -3.2973 0.35461
H  -1.631941 1.655646 -0.108463
H  6.30001 2.951315 1.290544
H  5.088186 2.106035 2.291352
H  6.795426 2.184267 2.830399
H  7.766021 -0.503345 -1.457878
H  6.252163 -0.965554 -2.282115
H  7.327352 0.268641 -3.012314
H  -6.453682 0.295884 -0.247511
H  -5.815044 2.714541 -0.429556
H  -4.176394 -4.595573 1.239147
H  -4.042203 -4.775927 -0.528577
H  -5.562802 -4.147944 0.191118
H  -3.579261 5.624925 -0.567816
H  -4.853817 4.737931 0.350167
H  -4.755534 4.579764 -1.449475
