program: Gaussian 09
title: 000221717
version: EM64L-G09RevD.01
frameworkgroup: C1[X(C16H24O2)]
method: RPBEPBE
basis: SDD
operation: Freq
keyword: #pfreq=noraman
keyword: PBEPBE/SDD
title: #p freq=noraman PBEPBE/SDD
converged: YES YES NO NO
title: Mulliken charges:
elementType: O O C C C C C C C C C C C C C C C C H H H H H H H H H H H H H H H H H H H H H H H H
charge: -0.255394 -0.250992 0.011435 -0.422840 -0.417615 -0.368262 -0.375017 -0.354995 -0.723023 -0.697331 0.288301 -0.655397 0.452522 -0.367128 -0.407800 -0.219976 -0.222100 -0.241987 0.208096 0.204939 0.186355 0.208695 0.210923 0.190302 0.204971 0.240396 0.221890 0.194281 0.196762 0.251787 0.212858 0.212391 0.210236 0.210716 0.216825 0.235752 0.239744 0.255998 0.233267 0.226302 0.225769 0.228347
chargesum: 0.00000
title: Mulliken charges with hydrogens summed into heavy atoms:
elementType: O O C C C C C C C C C C C C C C C C
charge: -0.255394 -0.250992 0.219530 -0.031546 0.002003 0.027011 0.087269 0.036048 -0.045988 -0.059553 0.288301 -0.179902 0.452522 -0.111130 -0.174533 0.006326 0.003670 -0.013641
polarizability: 2.25751784e+02 9.41628431e+00 1.62223241e+02 1.55686349e+01 -1.10890954e+01 1.42204082e+02
1716.lowfreq: -6.8729 -0.0005 -0.0003 0.0005 4.6198 7.1694 17.2319 19.5199 32.7905
frequency: 14.5190 17.3204 32.5053 37.3239 49.3678 62.3372 69.9102 96.8366 113.8010 122.9750 147.9472 185.4985 196.5295 229.9174 246.5053 264.8849 278.5900 291.7663 308.6168 324.6490 397.8606 402.9829 451.2475 468.1595 494.9584 522.5982 541.9997 610.1712 620.4005 694.0894 706.7596 728.6974 751.4005 761.1322 773.7690 803.9123 807.0778 829.0360 851.9250 890.2140 914.8153 920.5523 928.5438 954.2019 969.2591 974.8161 976.0552 989.6555 995.4180 997.8352 1026.7790 1027.8299 1039.4597 1077.2575 1078.3214 1092.2011 1106.7242 1138.4696 1151.9828 1161.7731 1172.4438 1188.4202 1201.9136 1210.8407 1225.3169 1235.7816 1252.8547 1266.1645 1280.8521 1285.1602 1292.0535 1298.3909 1330.2599 1333.9546 1345.8717 1357.1082 1361.7251 1370.1206 1384.3791 1391.2984 1395.4260 1441.2545 1456.4976 1458.3229 1465.8445 1470.6257 1476.8011 1477.8849 1481.7280 1483.9570 1485.8188 1492.3418 1493.5446 1595.2609 1611.3967 1633.8268 2955.8863 2959.4269 2962.0019 2968.9281 2973.0323 2980.0277 2988.3666 2997.7211 3010.5920 3019.7185 3022.6677 3028.2577 3037.2472 3069.4723 3070.2518 3071.7347 3082.2083 3090.7554 3099.4065 3121.3636 3126.9794 3138.5267 3148.7313 3164.3598
redmass: 3.4623 5.1194 4.1461 3.9945 5.2429 2.8455 1.6649 5.5353 2.4642 3.2017 2.0540 4.4149 2.0841 1.1110 1.7852 2.9882 2.6525 4.4696 2.3956 2.5180 2.7750 2.8082 2.7264 3.4391 3.3226 2.9793 2.7929 5.0204 5.6054 4.3336 1.7844 1.1024 1.9251 1.6649 1.5335 2.1053 2.1118 3.6465 1.2497 1.8445 1.4062 1.5616 2.3507 2.7239 2.0805 2.0794 1.4094 5.4952 1.3598 1.6754 1.4673 2.2164 2.4302 1.7125 2.4246 2.0464 1.7263 1.9211 2.3241 2.2890 1.0547 1.1190 2.7342 1.4708 1.4367 1.3249 1.2424 1.2015 1.1655 1.4740 1.0696 1.2916 1.2778 1.4571 1.4920 1.4328 1.4716 1.3761 7.7827 1.2181 1.2174 2.1163 1.1290 1.0819 1.0718 1.0758 1.0576 1.0438 1.0736 2.2108 1.0713 1.0632 1.0674 6.1946 6.1828 8.8916 1.0595 1.0602 1.0801 1.0605 1.0363 1.0369 1.0654 1.0937 1.1009 1.0572 1.0608 1.0993 1.1036 1.1003 1.0992 1.0993 1.1010 1.1075 1.1015 1.0851 1.0875 1.0923 1.0966 1.1017
irintensity: 0.0049 0.3570 0.4069 0.2053 0.5295 0.1024 0.0011 2.0093 0.1608 1.4219 1.0285 1.3379 0.8673 0.0056 0.4155 0.9247 2.0734 6.4785 0.7004 7.5172 3.7780 0.0095 3.3093 5.5908 1.1848 13.7352 2.9678 7.1275 4.4826 2.2853 66.4766 8.6249 32.3058 9.1300 19.6766 9.8814 2.1462 4.9924 0.3687 10.6837 4.5916 8.3583 13.3672 57.0060 9.3161 4.4949 0.3478 0.8571 0.9991 35.8538 2.6727 7.8340 0.1905 45.1993 2.3137 34.0731 188.3224 2.5500 1.1463 0.6464 0.7752 1.7505 0.8257 0.9234 117.4547 56.4604 8.1490 0.8536 5.8030 49.7284 1.0714 5.0739 10.6465 0.3889 0.4712 3.0293 3.4592 2.7724 2.3306 11.6047 24.3799 8.4372 16.1930 4.7968 0.7123 5.0899 3.2840 11.0006 24.3922 20.5136 21.1705 6.9185 3.8489 3.8611 22.2917 133.6235 7.5756 4.0112 9.9981 86.0662 38.3743 31.6202 30.0967 17.0750 5.1269 27.8134 14.7770 40.2597 68.7472 89.7493 51.5626 47.8384 44.9973 12.2160 6.0695 3.9319 0.2844 19.1647 35.0927 21.4188
temp: 298.150 k
press: 1.00000 atm
elementType: 8 8 6 6 6 6 6 6 6 6 6 6 6 6 6 6 6 6 1 1 1 1 1 1 1 1 1 1 1 1 1 1 1 1 1 1 1 1 1 1 1 1
symmnumber: 1
zpe: 954113.1 jmol-1
zpe.correction: 0.363402 hartree
zpe.thermalcorrener: 0.383336 hartree
zpe.thermalcorrenthalpy: 0.384280 hartree
zpe.thermalcorrgfe: 0.310960 hartree
zpe.sumelectzpe: -773.161209 hartree
zpe.sumelectthermal: -773.141276 hartree
zpe.sumelectthermalent: -773.140332 hartree
zpe.sumelectthermalfe: -773.213651 hartree
dipole: 0.8677 -1.4373 0.8446
dipole: 1.8793
quadrupole: -102.5225 -110.0316 -109.0094
quadrupole: 2.3196 0.5710 1.2065
quadrupole: 4.6654 -2.8438 -1.8216 2.3196 0.5710 1.2065
hfenergy: -773.5246119 hartree
pointgroup: C01 [X(C16H24O2)]
dipole: -0.3328047 -0.5676069 -0.3372905 debye
polarizability: 226.1798308|-8.4275346|161.6603226|14.9500884|11.6075847|142.338953 unknown
InChI: InChI=1S/C16H24O2/c1-3-5-9-14(4-2)13-18-16(17)12-15-10-7-6-8-11-15/h6-8,10-11,14H,3-5,9,12-13H2,1-2H3
charge 0 multiplicity 1
42 atoms
O  0.02064 -0.16186 -0.472818
O  0.708929 1.750529 0.68811
C  -2.470771 -0.106028 -0.365877
C  -3.66523 -0.550993 0.525345
C  -2.595594 1.346369 -0.907583
C  -5.04157 -0.483954 -0.173923
C  -1.166141 -0.331135 0.422969
C  -6.183033 -1.055769 0.698386
C  -2.7470 2.447781 0.166873
C  -7.562849 -0.976321 0.010439
C  0.880468 0.907818 -0.223644
C  2.061556 0.882945 -1.189402
C  3.301916 0.272091 -0.533042
C  3.952982 0.941756 0.534899
C  3.813253 -0.971118 -0.979491
C  5.098518 0.378665 1.139161
C  4.961211 -1.534811 -0.376031
C  5.608037 -0.860601 0.684565
H  -2.439148 -0.783606 -1.246159
H  -3.695191 0.063882 1.448315
H  -3.489261 -1.596155 0.857705
H  -1.703908 1.564214 -1.52781
H  -3.459814 1.387703 -1.598665
H  -4.99713 -1.043702 -1.131869
H  -5.282553 0.565715 -0.436268
H  -1.066026 0.364712 1.274795
H  -1.097537 -1.373772 0.779022
H  -5.954678 -2.111059 0.952822
H  -6.215798 -0.504847 1.660745
H  -1.869672 2.483016 0.836904
H  -2.834136 3.440062 -0.312512
H  -3.652887 2.297772 0.782644
H  -7.566045 -1.544694 -0.938862
H  -7.828087 0.0715 -0.226143
H  -8.361085 -1.389552 0.654028
H  1.780277 0.312267 -2.088467
H  2.265215 1.929558 -1.478631
H  3.552544 1.896369 0.895704
H  3.311584 -1.499509 -1.798967
H  5.593462 0.905521 1.962855
H  5.348173 -2.496024 -0.732861
H  6.498281 -1.295437 1.152739
