program: Gaussian 09
title: 000224792
version: EM64L-G09RevD.01
frameworkgroup: C1[X(C12H11NO3S)]
method: RPBEPBE
basis: SDD
operation: Freq
keyword: #p
keyword: freq=noraman
keyword: PBEPBE/SDD
title: #p freq=noraman PBEPBE/SDD
converged: YES YES NO NO
title: Mulliken charges:
elementType: S O O O N C C C C C C C C C C C C H H H H H H H H H H H
charge: 0.225348 -0.264035 -0.399015 -0.234386 -0.019260 0.396911 -0.068494 -0.238546 -0.486612 0.331809 -0.298884 -0.350717 -0.153836 -0.404449 -0.756518 -0.536490 0.287328 0.264632 0.260880 0.247041 0.278007 0.240682 0.296107 0.303116 0.248052 0.222794 0.223304 0.385231
chargesum: 0.00000
title: Mulliken charges with hydrogens summed into heavy atoms:
elementType: S O O O N C C C C C C C C C C C C
charge: 0.225348 -0.264035 -0.013784 -0.234386 -0.019260 0.396911 -0.068494 -0.238546 -0.221980 0.331809 -0.038003 -0.103676 0.124171 -0.163767 -0.157295 0.157659 0.287328
polarizability: 2.62694029e+02 -1.09034997e+01 1.84765944e+02 -4.35429532e+00 -1.32683351e+00 7.99118380e+01
1716.lowfreq: -6.5750 -3.9619 -1.4706 0.0007 0.0008 0.0017 24.3716 43.7129 66.4937
frequency: 24.0780 43.6929 66.4884 73.1796 87.2677 116.7086 147.7046 169.2694 193.5674 211.2339 238.9742 248.4719 322.9874 334.9063 403.4949 412.7927 423.5138 427.2890 510.8269 520.5466 527.2698 548.7878 566.4152 581.7092 653.7587 658.1344 659.9253 692.1745 740.8970 775.9782 791.3846 826.1532 843.8958 857.9256 869.9128 876.9308 896.4299 953.7709 962.0998 965.3839 1002.0676 1062.1627 1081.2441 1109.9561 1130.4120 1144.8278 1172.8462 1178.6339 1206.0839 1242.1424 1253.5869 1258.8911 1315.3243 1324.1594 1359.7418 1381.6064 1421.2029 1427.3163 1435.8345 1449.0775 1468.6596 1473.4913 1495.9679 1541.8250 1562.1375 1631.1684 1653.6834 2962.5767 3052.5028 3066.1103 3126.6452 3127.4079 3150.8629 3152.8773 3155.4743 3156.1442 3174.3434 3516.8678
redmass: 7.5878 8.7760 6.8358 3.5745 4.6347 6.5971 5.2798 5.0447 3.9522 3.0686 1.4926 4.6485 4.3085 7.1566 2.2900 6.2893 4.7659 3.8387 4.6325 4.8195 3.9966 4.5886 4.9856 2.5692 1.7691 6.4925 3.6175 6.0363 6.4814 2.4906 6.6021 1.7574 4.4935 1.4111 4.9846 1.7365 1.9631 2.4903 1.8033 1.4461 4.1271 1.9725 2.2694 1.2566 1.5645 1.6914 1.5373 1.2325 2.0709 1.2707 2.4234 1.6407 2.7616 2.6330 2.0119 3.7738 2.3849 1.1562 1.5407 2.2189 1.0507 1.0797 3.5743 7.1276 6.6055 6.9935 8.5829 1.0329 1.1042 1.0573 1.0897 1.0993 1.1085 1.0871 1.0958 1.0914 1.0971 1.0641
irintensity: 0.7407 0.4546 2.2821 4.9917 1.6174 1.4536 1.2302 0.3714 4.1486 3.5762 1.6723 1.1405 3.9544 0.8586 5.8568 1.5337 2.0651 4.4343 50.8592 6.2069 4.8736 9.4496 0.7071 49.6538 116.3148 54.0290 5.1596 13.9097 8.8311 3.7893 20.8430 21.9647 30.7059 27.9464 2.5298 44.4925 5.5929 9.5542 5.8047 2.2060 69.6513 273.2294 38.4706 0.1868 9.4701 24.6524 39.4345 35.4028 92.1884 12.8652 78.9166 86.2854 55.4753 48.3981 18.8954 5.2899 20.3155 24.5609 7.0086 41.3366 13.8892 51.6815 121.8893 58.2253 23.4183 116.3838 174.7823 84.6762 46.4767 5.1332 28.3310 18.5515 0.3418 3.6401 8.8024 0.2037 13.9227 41.7856
temp: 298.150 k
press: 1.00000 atm
elementType: 16 8 8 8 7 6 6 6 6 6 6 6 6 6 6 6 6 1 1 1 1 1 1 1 1 1 1 1
symmnumber: 1
zpe: 542218.1 jmol-1
zpe.correction: 0.206520 hartree
zpe.thermalcorrener: 0.222242 hartree
zpe.thermalcorrenthalpy: 0.223187 hartree
zpe.thermalcorrgfe: 0.161756 hartree
zpe.sumelectzpe: -1141.130087 hartree
zpe.sumelectthermal: -1141.114365 hartree
zpe.sumelectthermalent: -1141.113421 hartree
zpe.sumelectthermalfe: -1141.174851 hartree
dipole: 0.7758 -2.4092 0.6193
dipole: 2.6057
quadrupole: -70.7045 -114.5952 -105.6381
quadrupole: 0.7166 -1.4567 1.0920
quadrupole: 26.2747 -17.6159 -8.6589 0.7166 -1.4567 1.0920
hfenergy: -1141.3366071 hartree
pointgroup: C01 [X(C12H11N1O3S1)]
dipole: -0.0698152 1.0160158 0.1175393 debye
polarizability: 253.865878|-27.2604605|192.1534689|-0.3423596|-12.9645542|81.3524645 unknown
InChI: InChI=1S/C12H11NO3S/c1-16-8-2-3-10-9(6-8)11(4-5-13-10)17-7-12(14)15/h2-6,14H,7H2,1H3
charge 0 multiplicity 1
28 atoms
S  1.90211 1.023288 0.002443
O  -2.996765 2.809318 -0.155019
O  5.231268 0.510713 -0.758826
O  4.366566 -1.604959 -0.336182
N  -1.200094 -2.49349 0.493711
C  -0.68976 -0.059032 0.187106
C  -1.61108 -1.176833 0.32362
C  0.721286 -0.375335 0.215529
C  -1.211881 1.257222 0.033442
C  -2.596783 1.474751 0.00064
C  -3.015179 -0.915491 0.287044
C  -3.511721 0.378646 0.12541
C  1.123569 -1.703776 0.371646
C  0.125014 -2.721015 0.51797
C  3.466041 0.36532 0.855243
C  -4.43325 3.098089 -0.199508
C  4.366571 -0.373406 -0.111011
H  -0.548775 2.123554 -0.052635
H  -3.684915 -1.774495 0.39079
H  -4.592403 0.545883 0.100679
H  2.176671 -2.000026 0.350596
H  0.439329 -3.763539 0.646024
H  3.156506 -0.295375 1.677656
H  3.966625 1.263778 1.2436
H  -4.4991 4.188471 -0.326303
H  -4.93467 2.80249 0.742297
H  -4.920357 2.594322 -1.056658
H  5.780279 0.015725 -1.425908
