program: Gaussian 09
title: 000224793
version: EM64L-G09RevD.01
frameworkgroup: C1[X(C12H11N3O4)]
method: RPBEPBE
basis: SDD
operation: Freq
keyword: #p
keyword: freq=noraman
keyword: PBEPBE/SDD
title: #p freq=noraman PBEPBE/SDD
converged: YES YES NO NO
title: Mulliken charges:
elementType: O O O O N N N C C C C C C C C C C C C H H H H H H H H H H H
charge: -0.304016 -0.302952 -0.175247 -0.175383 -0.053532 -0.059352 -0.694189 0.273126 0.191362 -0.575793 -0.348795 0.558362 0.054079 0.076057 -0.416315 0.270159 0.270146 -0.741522 -0.741276 0.254217 0.259756 0.227032 0.318974 0.316499 0.263964 0.248015 0.246621 0.248157 0.248160 0.263686
chargesum: 0.00000
title: Mulliken charges with hydrogens summed into heavy atoms:
elementType: O O O O N N N C C C C C C C C C C C C
charge: -0.304016 -0.302952 -0.175247 -0.175383 -0.053532 -0.059352 -0.058716 0.273126 0.191362 -0.321576 -0.089039 0.558362 0.054079 0.076057 -0.189282 0.270159 0.270146 0.017078 0.018727
polarizability: 2.22578657e+02 1.14607580e+01 2.13784211e+02 2.06779167e+00 6.75708661e+00 9.70241641e+01
1716.lowfreq: -6.5747 -4.0721 -0.0007 -0.0006 0.0005 1.9429 27.2343 30.6199 45.7796
frequency: 27.2236 30.6083 45.7780 53.0487 60.3990 85.4568 95.1737 100.7862 120.8657 156.9243 184.9047 197.3724 253.6123 280.9372 308.7414 331.2291 375.9349 407.6861 410.9427 421.5295 452.0413 458.8680 491.9000 512.9912 522.7300 526.1438 538.9954 560.8874 587.5095 605.3057 662.7024 683.4890 707.2736 724.0355 728.9569 782.6552 796.5768 827.1315 839.1065 883.3448 913.3794 976.3022 980.6158 982.4684 1012.9326 1029.8855 1038.2120 1039.1089 1051.1053 1104.3470 1136.0333 1152.4235 1164.2351 1242.3029 1274.8995 1291.3938 1325.7501 1361.8297 1383.2131 1383.2582 1401.5869 1436.7074 1451.7573 1452.0326 1452.0746 1452.2186 1495.7176 1534.3308 1557.9028 1638.6328 1650.6034 1704.0383 1706.4402 3008.1353 3008.4150 3099.2454 3099.3738 3129.1598 3143.0015 3143.3472 3155.6234 3172.5738 3560.9488 3700.1127
redmass: 7.0398 6.4988 6.6148 3.1553 3.3542 3.9467 1.1727 1.0728 6.7819 5.9050 9.6685 6.9086 4.1853 5.1223 3.9727 5.3203 4.3120 1.2738 6.2573 2.1180 1.2679 6.0470 4.9533 5.6520 4.1256 3.5988 3.8685 6.1199 6.6577 5.9559 4.0838 6.8067 7.2054 6.7026 6.5603 4.1445 7.1902 6.7810 1.6888 1.7243 4.3353 1.3527 2.2990 2.1641 3.4794 3.7328 1.6551 1.6965 1.8574 7.8045 2.6686 2.3218 1.5104 1.6243 2.8840 5.8367 5.6397 2.9550 1.2431 1.2409 5.1826 9.1682 1.0520 1.0535 1.0510 1.0529 4.6379 6.6229 7.0576 3.3830 1.4125 10.7930 10.7889 1.0373 1.0372 1.0960 1.0957 1.0895 1.1021 1.1020 1.0917 1.0954 1.0453 1.1040
irintensity: 0.0726 3.6233 2.4632 7.5634 1.5197 0.0894 0.1212 0.0675 0.3222 0.2136 0.2016 2.8316 2.2188 4.6819 4.3079 4.6617 0.1958 41.5917 0.1878 0.3049 263.6215 7.2394 11.9390 11.4941 0.8504 3.4703 9.3763 28.6809 6.7848 19.3819 12.9447 0.7690 12.1468 13.9670 3.1686 12.1001 105.0129 198.5509 33.6617 31.3684 17.7146 1.6760 270.1663 74.1157 11.3813 122.4120 22.0397 5.5119 54.5108 119.3565 840.2282 303.7364 32.1204 29.9469 1.2890 171.7018 66.8002 48.0342 26.4675 89.2508 93.3763 58.8353 16.9204 9.9499 20.7054 41.5885 32.8506 4.6933 18.1157 99.6657 372.0861 3.7905 345.6017 1.0211 0.9113 5.9980 6.2322 14.4006 10.6432 11.5897 7.2582 6.9306 119.7403 25.6479
temp: 298.150 k
press: 1.00000 atm
elementType: 8 8 8 8 7 7 7 6 6 6 6 6 6 6 6 6 6 6 6 1 1 1 1 1 1 1 1 1 1 1
symmnumber: 1
zpe: 567266.0 jmol-1
zpe.correction: 0.216060 hartree
zpe.thermalcorrener: 0.234349 hartree
zpe.thermalcorrenthalpy: 0.235293 hartree
zpe.thermalcorrgfe: 0.167403 hartree
zpe.sumelectzpe: -927.650121 hartree
zpe.sumelectthermal: -927.631832 hartree
zpe.sumelectthermalent: -927.630888 hartree
zpe.sumelectthermalfe: -927.698778 hartree
dipole: 2.0915 8.6837 -1.4906
dipole: 9.0555
quadrupole: -73.2178 -92.8200 -120.2188
quadrupole: 2.3514 1.6251 8.8956
quadrupole: 22.2011 2.5988 -24.7999 2.3514 1.6251 8.8956
hfenergy: -927.8661814 hartree
pointgroup: C01 [X(C12H11N3O4)]
dipole: 0.9475146 -3.3946184 0.5213063 debye
polarizability: 223.4083841|-11.0630865|212.6550625|-2.4958395|8.9049893|97.3235859 unknown
InChI: InChI=1S/C12H11N3O4/c1-6(16)18-11-9-4-3-8(13)5-10(9)12(15-14-11)19-7(2)17/h3-5H,13H2,1-2H3
charge 0 multiplicity 1
30 atoms
O  2.550278 0.994887 0.443293
O  -2.884547 0.109855 0.405293
O  2.602412 2.37188 -1.469668
O  -3.345943 1.379302 -1.526236
N  0.341034 1.762029 0.560019
N  -1.040643 1.546606 0.551351
N  2.006481 -4.087165 -0.555413
C  0.760346 -0.636264 0.107744
C  -0.665121 -0.854738 0.098285
C  1.658339 -1.710378 -0.106912
C  -1.157821 -2.17501 -0.133339
C  1.156237 -3.011592 -0.338439
C  1.162397 0.726609 0.345309
C  -1.483425 0.29759 0.325288
C  -0.270647 -3.225772 -0.347117
C  3.14733 1.971506 -0.433819
C  -3.75006 0.836843 -0.490665
C  4.495636 2.361073 0.120092
C  -5.159505 0.777521 0.04389
H  2.735184 -1.515685 -0.088694
H  -2.238256 -2.344654 -0.136757
H  -0.653398 -4.238059 -0.525429
H  3.015073 -3.962547 -0.560192
H  1.638657 -5.018687 -0.727244
H  4.346285 3.055847 0.966344
H  5.089423 2.863323 -0.65737
H  5.029984 1.478849 0.50826
H  -5.394501 -0.233718 0.414127
H  -5.87056 1.077777 -0.739252
H  -5.247268 1.470976 0.899649
