program: Gaussian 09
title: 000019128
version: EM64L-G09RevD.01
frameworkgroup: C1[X(C3H7ClO3S)]
method: RPBEPBE
basis: SDD
operation: Freq
keyword: #p
keyword: freq=noraman
keyword: PBEPBE/SDD
title: #p freq=noraman PBEPBE/SDD
converged: YES YES NO NO
title: Mulliken charges:
elementType: Cl S O O O C C C H H H H H H H
charge: -0.070679 1.063238 -0.394009 -0.520727 -0.495989 -0.249427 -0.730649 -0.529570 0.236549 0.276127 0.285028 0.297063 0.289520 0.261928 0.281596
chargesum: 0.00000
title: Mulliken charges with hydrogens summed into heavy atoms:
elementType: Cl S O O O C C C
charge: -0.070679 1.063238 -0.394009 -0.520727 -0.495989 0.263249 0.140963 0.013954
polarizability: 8.95457894e+01 -5.06101569e+00 8.05888535e+01 2.86227822e+00 8.53541263e-01 6.25316685e+01
1716.lowfreq: -18.4689 -12.9289 -6.5752 -0.0020 0.0007 0.0016 43.3469 69.2271 106.4957
frequency: 43.1914 69.1546 106.4137 161.6729 176.1850 185.2065 230.0145 255.2918 278.4273 341.4439 392.6664 402.8284 503.6702 583.4602 604.4177 823.0423 833.9959 922.5771 925.0297 972.6261 997.3987 1047.7197 1064.9849 1169.5760 1221.7405 1294.2550 1318.2717 1355.4403 1411.0105 1419.1992 1431.3433 1442.6209 2961.9582 3023.2991 3030.8115 3060.5273 3146.7928 3182.8456 3188.3337
redmass: 7.7395 7.8127 4.5387 2.6039 1.5357 3.1341 3.9380 3.9491 4.6015 9.7666 7.1417 2.7957 5.3809 8.7723 4.7230 2.5064 11.2402 2.8027 2.1990 1.8050 1.3799 2.0154 2.3420 1.2403 1.1289 1.1658 1.1305 1.2478 1.0496 1.0527 1.0985 1.0686 1.0571 1.1031 1.0243 1.0588 1.1100 1.1087 1.1076
irintensity: 5.5477 7.3859 3.6702 2.1705 0.7574 5.1801 1.2094 5.5427 2.7279 30.8682 27.6836 17.2190 62.9384 20.5338 39.6720 32.4284 57.2339 17.0946 50.6898 45.5876 21.3555 86.5741 6.7118 4.1866 1.1442 14.9192 2.5590 7.8036 9.3786 16.5852 8.5509 19.3900 26.2041 4.0228 3.2394 22.1827 6.4074 4.1228 1.1747
temp: 298.150 k
press: 1.00000 atm
elementType: 17 16 8 8 8 6 6 6 1 1 1 1 1 1 1
symmnumber: 1
zpe: 272625.6 jmol-1
zpe.correction: 0.103838 hartree
zpe.thermalcorrener: 0.114297 hartree
zpe.thermalcorrenthalpy: 0.115241 hartree
zpe.thermalcorrgfe: 0.066913 hartree
zpe.sumelectzpe: -1201.466994 hartree
zpe.sumelectthermal: -1201.456534 hartree
zpe.sumelectthermalent: -1201.455590 hartree
zpe.sumelectthermalfe: -1201.503918 hartree
dipole: 2.7533 0.8029 -1.6559
dipole: 3.3117
quadrupole: -69.6715 -54.4756 -66.9402
quadrupole: -13.3886 0.5197 -3.5989
quadrupole: -5.9757 9.2202 -3.2444 -13.3886 0.5197 -3.5989
hfenergy: -1201.5708312 hartree
pointgroup: C01 [X(C3H7Cl1O3S1)]
dipole: -1.0155718 -0.4825533 -0.6583416 debye
dipolederiv: -0.2544855 0.0296322 -0.0006152 -0.0955051 -0.5418016 0.0002127 -0.0001231 0.0236215 -0.1672519 1.7630244 -0.0242438 -0.010052 -0.1440523 1.2378241 0.0283272 0.1187658 0.024541 1.2268543 -1.1070036 0.1537004 -0.0394754 0.2016868 -0.4151996 0.0032113 0.0902644 -0.0309508 -0.4250501 -0.5291542 -0.0075589 0.0316657 0.0493816 -0.505746 0.0332383 -0.0476042 0.0059046 -0.64784 -0.6981912 -0.0882556 0.0321862 -0.086055 -0.5255921 -0.0289212 0.1054491 -0.0008089 -0.4820428 0.6570968 -0.064706 -0.0544696 -0.1079964 0.0947943 -0.0015272 -0.4186261 0.107347 0.0921436 -0.1609721 -0.0379916 0.0219612 -0.0255512 -0.1041633 -0.0085804 -0.0014573 -0.0152424 -0.0927749 0.0487913 -0.0315312 0.0088674 0.1216812 0.6797823 -0.0487973 0.0718482 -0.0574805 0.189502 -0.1043763 0.0231775 0.0322867 0.0678107 -0.1220151 -0.0214371 0.0332015 -0.0137052 0.1173432 0.0672486 -0.0024392 -0.0619531 -0.0125456 0.1246544 0.0543535 0.0451385 -0.0066582 0.0115437 0.0317217 0.0412782 -0.0424301 0.0608795 0.0431802 -0.0151879 -0.0213211 -0.0256667 0.0831114 0.1247269 -0.0349477 0.02255 -0.0425001 0.0464221 -0.0178411 0.0089958 -0.0267549 0.0846052 0.1243874 -0.0015827 0.0028376 0.0010086 0.0352009 -0.0003868 0.0033062 0.0123397 0.006415 -0.0732644 0.041944 0.0687998 0.0141161 -0.0114218 -0.0186632 0.0865506 -0.0222274 0.0549523 0.1104504 0.0035243 -0.0121591 -0.0023589 -0.0359187 0.0419991 -0.0743881 0.0257414 -0.051511 unknown
polarizability: 90.9981992|-2.4009195|78.9841008|-4.0158769|0.1764806|62.6840115 unknown
InChI: InChI=1S/C3H7ClO3S/c1-8(5,6)7-3-2-4/h2-3H2,1H3
charge 0 multiplicity 1
15 atoms
Cl -2.07337 -1.505863 0.034203
S  1.572451 0.195304 0.020671
O  -0.001223 0.933554 -0.764032
O  1.26578 -0.061779 1.593639
O  2.811255 1.110918 -0.451705
C  -1.092724 1.147093 0.19599
C  1.575389 -1.445112 -0.932559
C  -2.324541 0.353439 -0.221045
H  -1.335168 2.229014 0.179649
H  -0.766302 0.874526 1.221421
H  2.467083 -1.993257 -0.597822
H  0.630489 -1.937941 -0.666364
H  1.620627 -1.166243 -1.993623
H  -3.196215 0.618584 0.397909
H  -2.550431 0.471663 -1.290432
