program: Gaussian 09
title: 000224787
version: EM64L-G09RevD.01
frameworkgroup: C1[X(C11H6O4)]
method: RPBEPBE
basis: SDD
operation: Freq
keyword: #pfreq=noraman
keyword: PBEPBE/SDD
title: #p freq=noraman PBEPBE/SDD
converged: NO YES NO YES
title: Mulliken charges:
elementType: O O O O C C C C C C C C C C C H H H H H H
charge: -0.204935 -0.208844 -0.218521 -0.182496 0.190474 -0.075343 -0.422737 0.206941 0.060451 0.205349 0.200900 -0.349727 -0.337985 -0.238440 -0.204985 0.266359 0.266350 0.283834 0.275511 0.243357 0.244487
chargesum: 0.00000
title: Mulliken charges with hydrogens summed into heavy atoms:
elementType: O O O O C C C C C C C C C C C
charge: -0.204935 -0.208844 -0.218521 -0.182496 0.190474 -0.075343 0.109972 0.206941 0.060451 0.205349 0.200900 -0.065893 -0.062474 0.004917 0.039502
polarizability: 1.78377959e+02 -3.87259121e+00 1.54323868e+02 8.78899665e-03 7.50318231e-03 5.28073152e+01
1716.lowfreq: -9.6035 -3.6695 0.0002 0.0009 0.0010 7.5202 77.4097 96.3988 140.3954
frequency: 77.4081 96.3943 140.3954 188.1648 205.5226 259.1356 275.6178 294.4178 337.7328 405.9335 429.5975 488.6552 500.8113 532.3704 534.3213 623.0884 629.0783 645.3676 684.3457 723.2010 739.3637 770.9194 796.1935 809.1582 857.4750 892.5322 937.3498 960.5280 978.4013 987.1119 1006.4167 1025.1532 1044.1149 1090.4270 1119.3276 1159.5889 1183.4097 1194.3341 1234.1677 1280.4965 1297.1178 1390.8199 1413.7424 1444.1942 1450.5694 1458.5933 1558.0702 1569.8589 1620.0484 1632.1049 1712.6502 3029.3715 3089.5422 3145.4033 3156.3028 3169.3303 3180.5723
redmass: 6.8773 6.9611 5.9148 8.1020 4.6739 5.4251 7.7969 3.2351 8.3433 8.0061 3.7171 8.7576 5.8703 4.2040 11.0957 8.9697 9.8181 6.9979 4.2184 9.3589 7.1229 2.0096 1.9875 7.8654 7.9423 1.4780 10.4982 5.9059 1.3708 1.7711 1.3390 2.0842 8.6572 2.4747 1.0725 1.4948 1.9012 2.0277 4.6581 1.6657 1.6421 7.9297 7.1839 2.6589 1.1052 2.6728 8.9529 7.8652 7.1137 9.9838 12.9788 1.0579 1.1072 1.0865 1.0906 1.0956 1.1001
irintensity: 1.2846 8.1076 1.5675 6.3306 7.6514 0.1513 9.6983 1.3957 0.8295 1.5079 5.4831 0.1779 5.0229 1.6012 0.9025 4.8311 1.8418 8.6202 19.3544 1.9235 2.8026 69.4434 26.1250 2.1627 26.3946 0.4391 24.7114 108.3294 3.5663 0.0366 0.0656 16.5588 41.3493 39.1495 0.1138 3.8153 56.6750 12.8496 13.4309 27.7072 4.7445 5.5841 98.7828 51.3260 21.5994 1.1774 109.2439 44.5113 50.5636 120.0820 380.0773 5.4375 3.2302 3.4574 2.0841 8.5299 10.9019
temp: 298.150 k
press: 1.00000 atm
elementType: 8 8 8 8 6 6 6 6 6 6 6 6 6 6 6 1 1 1 1 1 1
symmnumber: 1
zpe: 379553.1 jmol-1
zpe.correction: 0.144564 hartree
zpe.thermalcorrener: 0.155449 hartree
zpe.thermalcorrenthalpy: 0.156393 hartree
zpe.thermalcorrgfe: 0.107642 hartree
zpe.sumelectzpe: -722.626202 hartree
zpe.sumelectthermal: -722.615317 hartree
zpe.sumelectthermalent: -722.614373 hartree
zpe.sumelectthermalfe: -722.663124 hartree
dipole: 4.7407 0.3536 -0.0003
dipole: 4.7539
quadrupole: -82.8629 -93.7174 -84.5866
quadrupole: -15.8687 0.0005 -0.0048
quadrupole: 4.1927 -6.6618 2.4691 -15.8687 0.0005 -0.0048
hfenergy: -722.7707657 hartree
pointgroup: C01[X(C11H6O4)]
dipole: 1.8646299 0.1457168 -0.0001355 debye
dipolederiv: -1.1986031 0.3132559 0.0000125 0.0935798 -0.5557576 -0.0000306 0.0000707 -0.0002435 -0.1126007 -0.6537847 0.2261858 0.0000963 0.0401938 -0.8338742 -0.0001303 0.0000247 0.0000296 -0.2935267 -0.5225295 -0.0528422 0.0000353 0.1237206 -1.0902468 0.0002721 0.0000836 -0.0005053 -0.3371226 -0.6675234 -0.3363111 0.000035 -0.2931024 -1.0138469 0.0000435 -0.0000531 -0.0002629 -0.3071696 -0.3170395 -0.5293511 -0.0000798 -0.0895656 -0.3106984 -0.0000468 0.000232 0.0000766 -0.1000005 0.2382311 -0.5639897 -0.0000985 -0.5816871 0.4509948 -0.0000335 0.00008 0.0002117 0.1282046 0.2313744 0.1979742 0.0000263 0.0416888 0.239938 0.0000019 0.0000893 -0.0000371 0.3202309 -0.4075409 0.2949573 0.0000068 0.2673678 -0.3953432 0.000002 -0.0001082 0.0000535 -0.0182815 1.0154183 0.135017 0.0000277 -0.1779905 1.3024499 -0.0001251 -0.0001275 0.0002448 0.1897822 0.8938752 0.0363825 0.0000395 -0.0106214 0.206809 -0.0000943 -0.0000611 0.000184 0.1089421 1.2877868 0.2940522 -0.0001286 0.4092849 1.6684573 0.0000979 -0.0001781 0.0002377 0.2660391 0.0211467 -0.124013 0.0000406 0.1089747 0.084569 -0.0000161 0.0000489 -0.0000323 -0.0996448 -0.3325055 -0.0055183 -0.0000111 0.059039 0.0821063 0.0000249 -0.0000639 -0.0000023 -0.1551962 0.0854841 0.1631067 0.0000726 0.1375928 -0.1849676 0.0000351 0.000066 0.0000647 -0.1531634 0.1053049 -0.0151746 0.0000657 -0.0842804 0.1721658 -0.0000189 0.0000477 -0.0000183 -0.1265318 0.0583084 -0.0256006 0.0272596 -0.0055868 0.0324919 -0.049136 0.0404198 -0.0793441 0.0143711 0.0583058 -0.0255565 -0.0272893 -0.0055641 0.0324451 0.0491415 -0.0404619 0.0793327 0.0144145 0.113744 0.0242584 -0.0000118 -0.0527482 0.0158637 0.0000078 -0.0000354 0.0000091 0.156901 0.0962766 -0.0497494 -0.0000184 -0.0152436 0.0008771 -0.0000007 0.0000335 0.000013 0.1813109 -0.0844336 -0.0511546 -0.0000463 -0.0569037 0.0719023 -0.0000161 -0.00006 -0.0000265 0.1646305 -0.0212961 0.094071 -0.0000341 0.0918514 0.0236645 0.0000217 -0.000047 0.0000149 0.1584112 unknown
polarizability: 178.405031|-3.7874851|154.2967958|0.0087624|0.0075342|52.8073152 unknown
InChI: InChI=1S/C11H6O4/c12-9-6-3-1-2-4-8(6)15-10-7(9)5-14-11(10)13/h1-4H,5H2
charge 0 multiplicity 1
21 atoms
O  -0.234063 -1.397529 -0.000158
O  -3.464549 0.260823 0.000448
O  0.267537 2.814637 0.000705
O  -3.194863 -2.076679 0.000004
C  -1.165127 0.866615 0.000003
C  -1.271618 -0.500815 0.000012
C  -2.553021 1.449032 0.0004
C  1.273719 0.586625 -0.000033
C  0.130001 1.549505 -0.000514
C  1.068808 -0.824632 -0.000062
C  -2.697312 -0.94342 0.000437
C  2.613463 1.060172 0.000295
C  2.138593 -1.741342 0.000186
C  3.692564 0.161679 0.000527
C  3.453397 -1.240792 0.000474
H  -2.77542 2.047361 0.900392
H  -2.775811 2.047522 -0.899386
H  2.763835 2.144811 0.000279
H  1.92363 -2.813574 0.000178
H  4.720422 0.537665 0.000743
H  4.296215 -1.939565 0.000673
