program: Gaussian 09
title: 000224784
version: EM64L-G09RevD.01
frameworkgroup: C1[X(C9H7ClN2)]
method: RPBEPBE
basis: SDD
operation: Freq
keyword: #p
keyword: freq=noraman
keyword: PBEPBE/SDD
title: #p freq=noraman PBEPBE/SDD
converged: NO YES NO NO
title: Mulliken charges:
elementType: Cl N N C C C C C C C C C H H H H H H H
charge: -0.070366 -0.070426 -0.657721 0.511442 -0.139926 0.500331 -0.466382 -0.341087 -0.328600 -0.254938 -0.180663 -0.374141 0.238058 0.247709 0.248783 0.229682 0.242534 0.316964 0.348747
chargesum: 0.00000
title: Mulliken charges with hydrogens summed into heavy atoms:
elementType: Cl N N C C C C C C C C C
charge: -0.070366 -0.070426 0.007990 0.511442 -0.139926 0.500331 -0.228324 -0.341087 -0.080891 -0.006155 0.049019 -0.131608
polarizability: 1.90470448e+02 -1.65138520e+00 1.33266358e+02 1.77628291e-03 -1.85199220e-03 4.59790420e+01
1716.lowfreq: -7.0637 -0.0011 -0.0009 0.0026 6.8244 16.1770 89.0936 144.0093 207.7211
frequency: 89.0928 144.0092 207.7210 235.7004 279.3460 279.5554 335.6574 426.0235 470.6770 473.7307 498.4725 503.6677 579.9700 581.9438 602.9215 638.7088 670.4241 705.4182 760.8303 803.2966 828.1987 841.1156 874.3611 932.5901 939.8631 987.9086 1030.7992 1036.4605 1102.3336 1143.7986 1162.8217 1221.0198 1235.9902 1282.5940 1342.1814 1389.6735 1411.5803 1424.9008 1472.0941 1493.4357 1555.3791 1578.1298 1587.2695 1627.1585 3127.6895 3134.1818 3142.4364 3167.1034 3168.5345 3509.2851 3679.5166
redmass: 7.8005 4.8275 9.5833 4.2547 3.6099 5.1268 11.8713 2.9186 1.3632 4.7627 2.9231 5.3764 6.8975 3.7005 7.2900 1.1362 3.8737 5.7839 1.2786 2.4136 4.8853 2.1393 5.6147 1.3346 1.4114 1.3779 2.5396 2.2211 2.1309 1.2499 2.0655 1.9852 1.5288 2.4122 5.5152 2.0297 1.9688 6.6838 3.7065 4.0950 1.9132 5.7907 2.8009 5.5299 1.0878 1.0919 1.0879 1.0974 1.0987 1.0456 1.1030
irintensity: 0.2805 1.9800 0.2853 11.1468 11.0176 5.9965 1.2072 35.1366 106.3669 8.0911 36.6596 4.4375 1.0621 2.4122 10.7293 62.2146 66.3916 4.3400 5.5583 26.4211 31.6888 65.0523 2.0412 0.2597 0.9900 1.3017 50.2041 11.7184 54.3374 1.3608 2.8973 5.4804 0.9800 4.7497 3.7983 20.6689 13.1689 69.7458 44.9445 34.4841 24.8537 26.1241 125.6800 206.3118 8.1866 17.0137 3.0511 12.9579 25.2524 84.0366 62.4619
temp: 298.150 k
press: 1.00000 atm
elementType: 17 7 7 6 6 6 6 6 6 6 6 6 1 1 1 1 1 1 1
symmnumber: 1
zpe: 369153.1 jmol-1
zpe.correction: 0.140603 hartree
zpe.thermalcorrener: 0.149994 hartree
zpe.thermalcorrenthalpy: 0.150938 hartree
zpe.thermalcorrgfe: 0.105819 hartree
zpe.sumelectzpe: -915.907926 hartree
zpe.sumelectthermal: -915.898535 hartree
zpe.sumelectthermalent: -915.897591 hartree
zpe.sumelectthermalfe: -915.942710 hartree
dipole: 1.9100 0.3972 -0.0006
dipole: 1.9509
quadrupole: -68.8582 -65.8126 -81.3499
quadrupole: 4.0483 0.0016 0.0020
quadrupole: 3.1487 6.1943 -9.3430 4.0483 0.0016 0.0020
hfenergy: -916.048529 hartree
pointgroup: C01 [X(C9H7Cl1N2)]
dipole: -0.7458193 0.1813148 0.0002447 debye
dipolederiv: -0.8667227 0.0753676 -0.0000336 0.1869907 -0.1479927 0.0000136 -0.0000794 0.0000035 -0.0658391 -0.4135837 -0.049784 -0.0000074 0.0985876 -0.4112852 0.0000022 0.0000153 -0.0000195 -0.2262009 -0.2744344 0.2906992 0.0001228 0.3979504 -1.3689794 -0.0001012 0.0002014 -0.0002987 -0.6490224 0.0200927 0.0378709 -0.0000105 0.6027828 -0.0327183 0.000002 -0.0000067 0.0000031 0.1219728 0.3276163 0.4453469 0.0000212 -0.4331369 -0.0804951 -0.0000138 0.0000048 0.0000579 -0.0184568 -0.3118715 -0.2598233 -0.0000632 -0.4034572 1.3493325 0.0000887 -0.0000856 0.0000623 0.154895 -0.3902779 0.0450719 0.0000215 -0.0268206 -0.066759 -0.0000233 0.0000122 -0.0000694 -0.2654012 1.240868 -0.4369217 0.0000631 0.0786185 -0.3735 -0.0000416 0.0001631 -0.0000167 -0.1696328 0.1337208 0.0004152 0.0000073 -0.0828181 0.2062213 0.0000038 -0.0000034 -0.0000014 -0.1417768 0.0082756 -0.0183223 -0.0000399 -0.2642577 0.286761 0.0000353 -0.0000622 0.0000142 -0.0527465 0.0018191 -0.0786051 0.0000077 -0.1352673 -0.2050683 -0.0000037 0.0000257 -0.0000022 -0.1263816 0.1499585 0.0758829 -0.0000035 0.1118709 0.3397721 0.0000127 -0.0000172 0.0000059 -0.077754 0.0292161 0.0764589 -0.0000047 0.0145332 -0.0803044 0.0000097 0.0000023 0.0000383 0.1781585 0.0742924 0.0136506 -0.0000007 0.0822613 -0.0785625 -0.0000009 -0.0000051 0.0000024 0.1451745 0.0163128 -0.0946592 0.0000009 -0.0779489 0.0389529 -0.0000006 0.0000006 -0.0000005 0.1583535 -0.12456 0.0357296 -0.0000063 0.0417921 0.0936179 -0.0000004 -0.0000151 0.0000001 0.1662244 -0.0444443 -0.0938731 -0.0000006 -0.121952 -0.0267809 -0.0000037 0.0000023 -0.0000002 0.1340983 0.1878308 -0.0536497 -0.0000602 -0.0371944 0.2612974 -0.0000037 -0.0001245 0.0001344 0.3768731 0.2358916 -0.0108554 -0.0000137 -0.0325343 0.2964908 0.0000249 -0.0000287 0.0000867 0.357462 unknown
polarizability: 190.5168728|-0.263146|133.2199331|0.0018372|0.0017916|45.979042 unknown
InChI: InChI=1S/C9H7ClN2/c10-7-4-3-6-2-1-5-12-9(6)8(7)11/h1-5H,11H2
charge 0 multiplicity 1
19 atoms
Cl 3.787706 -0.221045 0.000097
N  -1.256883 -1.461342 -0.000057
N  1.371358 -2.150587 -0.0001
C  -0.713074 0.968032 0.000016
C  -0.337344 -0.426936 0.000006
C  1.063541 -0.811439 -0.000036
C  0.301943 1.977445 0.000037
C  2.011767 0.231664 -0.000033
C  -2.117474 1.254705 0.000007
C  1.650765 1.602381 0.000016
C  -3.042994 0.20711 -0.000017
C  -2.566347 -1.141863 -0.000047
H  0.022909 3.036054 -0.000011
H  -2.451176 2.298952 0.000009
H  2.441694 2.358826 0.000021
H  -4.120272 0.399272 -0.000047
H  -3.272657 -1.980103 -0.000057
H  2.336767 -2.467507 0.000265
H  0.583569 -2.800219 -0.00007
