program: Gaussian 09
title: 000224763
version: EM64L-G09RevD.01
frameworkgroup: C1[X(C12H16O3)]
method: RPBEPBE
basis: SDD
operation: Freq
keyword: #pfreq=noraman
keyword: PBEPBE/SDD
title: #p freq=noraman PBEPBE/SDD
converged: YES YES NO NO
title: Mulliken charges:
elementType: O O O C C C C C C C C C C C C H H H H H H H H H H H H H H H H
charge: -0.252285 -0.454597 -0.258391 -0.045670 -0.298625 -0.691178 -0.694794 -0.296961 0.388423 0.215630 -0.378645 -0.367799 -0.219369 -0.226472 -0.239214 0.212733 0.224620 0.236602 0.214188 0.213099 0.244049 0.224807 0.213259 0.213954 0.262413 0.265763 0.246920 0.226543 0.226090 0.228193 0.366715
chargesum: 0.00000
title: Mulliken charges with hydrogens summed into heavy atoms:
elementType: O O O C C C C C C C C C C C C
charge: -0.252285 -0.087882 -0.258391 0.167063 0.162597 -0.019842 -0.042775 -0.034548 0.388423 0.215630 -0.112882 -0.120879 0.007175 -0.000382 -0.011020
polarizability: 1.49334021e+02 -8.00157959e+00 1.41130137e+02 1.92526208e+01 9.84919648e+00 1.10576835e+02
1716.lowfreq: -8.3871 -0.0004 -0.0001 0.0003 3.0845 6.7251 19.3957 33.3818 45.2881
frequency: 18.9840 33.2474 45.2832 58.3515 69.3361 109.5656 181.4510 198.9136 223.0550 224.6914 241.9219 275.0308 282.1321 338.3525 365.9822 383.0952 405.6544 411.0086 431.8414 481.2049 522.7645 585.0112 614.9531 642.8194 696.0252 711.7563 754.4863 812.1113 834.0107 855.3624 857.8067 889.2484 923.6891 931.0904 940.2635 955.6948 966.5845 981.0727 989.6726 998.1687 1019.3139 1028.2859 1084.8266 1133.2755 1150.8239 1168.8714 1172.8584 1176.0109 1185.8611 1188.6586 1222.6051 1251.3268 1272.5669 1292.9976 1320.7527 1343.5298 1356.6279 1367.9511 1383.4999 1388.2265 1401.5238 1436.2977 1455.5905 1467.8836 1472.8890 1478.7157 1483.6540 1491.4689 1594.4388 1608.8014 1620.0351 2974.5250 2980.8633 2988.1957 3018.3662 3025.4227 3066.6636 3076.0612 3081.9577 3084.6504 3097.5145 3122.9306 3131.8646 3144.4883 3158.4545 3169.9843 3453.9691
redmass: 3.5000 3.7889 3.8560 3.0551 7.1580 4.6742 3.0140 1.3552 1.8772 3.3324 1.5308 4.3610 3.9272 6.0873 2.7350 1.8188 2.9269 1.9036 1.6694 3.2339 4.6708 6.6905 6.4347 5.4564 4.0272 1.8206 2.2073 2.7021 3.9805 3.6823 1.3218 2.1892 1.1942 1.5511 1.9111 1.8518 1.5871 1.4600 4.3943 1.3579 4.2533 2.2943 1.6175 2.2611 2.3074 1.3857 1.7788 1.5493 1.8441 1.3249 1.7036 1.2248 1.3586 1.3440 1.3137 1.4077 1.3306 1.5769 1.2062 4.1568 1.2072 2.1732 1.0890 1.0604 1.0487 2.2123 1.0583 1.0485 6.2622 6.2103 8.1048 1.0358 1.0366 1.0835 1.0571 1.0843 1.0999 1.1001 1.0990 1.0995 1.1083 1.0846 1.0884 1.0937 1.0970 1.0980 1.0649
irintensity: 0.1392 0.3950 0.2368 0.4147 0.8685 0.3548 1.9031 1.6825 4.5898 1.0295 2.9350 3.5984 1.1779 31.9612 12.8682 52.7466 5.7985 1.1028 56.0685 10.0325 21.6085 6.1716 0.5670 14.3668 6.2866 75.1439 31.0086 5.8648 0.3804 16.7109 2.5161 12.3199 8.7206 14.3704 7.6986 23.1126 0.3660 0.3719 0.4431 0.8274 131.8779 34.4842 12.7493 6.3045 174.0163 22.4807 60.7782 6.2711 2.0545 3.3468 131.5336 18.0081 4.8489 0.9959 3.8919 5.7506 10.4443 38.6365 14.3029 8.0204 11.7355 12.5589 10.3355 12.3258 5.9288 18.5130 11.5743 19.2043 1.1622 32.6606 124.6797 33.9858 14.8826 14.2180 37.0483 11.1024 28.8810 12.2281 50.0269 31.1019 21.8952 0.6261 6.1315 27.1343 21.8223 13.4440 42.9258
temp: 298.150 k
press: 1.00000 atm
elementType: 8 8 8 6 6 6 6 6 6 6 6 6 6 6 6 1 1 1 1 1 1 1 1 1 1 1 1 1 1 1 1
symmnumber: 1
zpe: 668938.4 jmol-1
zpe.correction: 0.254785 hartree
zpe.thermalcorrener: 0.270365 hartree
zpe.thermalcorrenthalpy: 0.271309 hartree
zpe.thermalcorrgfe: 0.209982 hartree
zpe.sumelectzpe: -691.405473 hartree
zpe.sumelectthermal: -691.389893 hartree
zpe.sumelectthermalent: -691.388949 hartree
zpe.sumelectthermalfe: -691.450275 hartree
dipole: -2.5950 -2.7591 -0.5312
dipole: 3.8248
quadrupole: -84.0205 -91.9504 -88.4741
quadrupole: -3.8808 6.2396 0.4842
quadrupole: 4.1278 -3.8021 -0.3258 -3.8808 6.2396 0.4842
hfenergy: -691.6602578 hartree
pointgroup: C01 [X(C12H16O3)]
dipole: -1.0297417 1.0543216 0.3039573 debye
polarizability: 148.9754972|9.7370328|139.4569236|-18.8007759|12.0376866|112.6085734 unknown
InChI: InChI=1S/C12H16O3/c1-9(2)8-15-12(14)11(13)10-6-4-3-5-7-10/h3-7,9,11,13H,8H2,1-2H3
charge 0 multiplicity 1
31 atoms
O  -1.471842 -0.79163 0.893069
O  1.401182 -2.696396 -0.270284
O  -1.091722 -1.996874 -1.076832
C  -3.086269 0.97687 0.180246
C  -2.899255 -0.513019 0.517482
C  -2.251762 1.398418 -1.050062
C  -4.596678 1.241356 -0.040121
C  0.769286 -1.624703 0.481256
C  1.505594 -0.281406 0.323701
C  -0.692937 -1.496302 0.004559
C  2.481386 -0.123895 -0.687262
C  1.222795 0.798845 1.196866
C  3.158461 1.108477 -0.834967
C  1.902998 2.028014 1.050397
C  2.871158 2.188372 0.030845
H  -2.749352 1.567236 1.056351
H  -3.475347 -0.80128 1.412848
H  -3.168635 -1.159165 -0.337884
H  -2.42754 2.463213 -1.287688
H  -2.527031 0.798915 -1.938044
H  -1.169736 1.270591 -0.870556
H  -4.772867 2.313742 -0.237452
H  -5.198668 0.956387 0.843241
H  -4.974869 0.673904 -0.911824
H  0.760595 -1.915824 1.547334
H  2.719166 -0.977636 -1.328865
H  0.468489 0.679806 1.983165
H  3.915177 1.221201 -1.619687
H  1.681152 2.857053 1.731957
H  3.399976 3.141556 -0.081837
H  0.831496 -2.873425 -1.070246
