program: Gaussian 09
title: 000224761
version: EM64L-G09RevD.01
frameworkgroup: C1[X(C8H7Cl3)]
method: RPBEPBE
basis: SDD
operation: Freq
keyword: #pfreq=noraman
keyword: PBEPBE/SDD
title: #p freq=noraman PBEPBE/SDD
converged: YES YES NO NO
title: Mulliken charges:
elementType: Cl Cl Cl C C C C C C C C H H H H H H H
charge: -0.027681 0.052662 0.029260 -0.534036 0.610187 -0.545434 -0.417888 -0.330946 -0.212476 -0.223890 -0.232893 0.317619 0.339323 0.237072 0.237419 0.234164 0.232149 0.235388
chargesum: 0.00000
title: Mulliken charges with hydrogens summed into heavy atoms:
elementType: Cl Cl Cl C C C C C C C C
charge: -0.027681 0.052662 0.029260 -0.216416 0.610187 -0.206111 -0.180816 -0.093527 0.021688 0.008259 0.002496
polarizability: 1.47832646e+02 1.97049403e+01 9.39074700e+01 2.37741366e+00 -6.27348460e+00 9.19110025e+01
1716.lowfreq: -9.0061 -0.0024 -0.0019 0.0029 7.0741 9.8252 29.7539 47.7578 74.3873
frequency: 29.6626 47.7080 74.3667 151.6148 167.3170 214.4117 239.2011 279.8955 312.5392 392.5912 400.4119 498.2388 575.3452 612.5332 639.3549 684.2393 698.7256 717.2554 781.6867 826.6016 847.7906 925.5094 976.4831 990.1584 999.7511 1024.6442 1056.2601 1091.5902 1167.3156 1175.7738 1176.9694 1190.6990 1202.6879 1229.6668 1307.7187 1349.4214 1389.1164 1444.6012 1482.7292 1594.7543 1611.2498 3099.2139 3127.6155 3129.6443 3141.3243 3144.0702 3154.3473 3169.8195
redmass: 4.7346 12.6557 7.9345 9.8004 7.0412 11.0977 9.6859 7.6665 17.9314 4.3757 2.8509 3.8178 7.1127 6.3400 7.3352 6.1469 1.5959 5.4455 2.1061 4.4083 1.2569 1.4467 1.4056 6.0373 1.3300 2.3922 3.5382 1.8409 1.0980 1.0640 1.1173 1.1198 1.3302 1.9606 1.3813 1.3454 6.2848 2.1464 2.2907 6.0391 6.0827 1.0874 1.0857 1.0884 1.0913 1.0893 1.0963 1.1017
irintensity: 0.0070 0.2035 0.2266 2.7292 2.4278 1.2245 2.1339 1.4014 0.8701 9.2183 1.2220 3.8781 44.0344 7.3034 129.6138 24.7229 65.6900 68.9305 27.0591 0.7637 0.0724 0.5758 0.2048 1.2225 0.0100 1.5653 6.5858 9.1062 10.2858 0.6970 6.5249 2.1311 3.2546 22.7254 0.2781 1.5701 0.5674 12.6997 4.7689 0.8240 0.9961 0.8016 4.7349 0.7653 11.1735 0.7333 30.9058 18.0998
temp: 298.150 k
press: 1.00000 atm
elementType: 17 17 17 6 6 6 6 6 6 6 6 1 1 1 1 1 1 1
symmnumber: 1
zpe: 332230.6 jmol-1
zpe.correction: 0.126540 hartree
zpe.thermalcorrener: 0.137301 hartree
zpe.thermalcorrenthalpy: 0.138245 hartree
zpe.thermalcorrgfe: 0.087527 hartree
zpe.sumelectzpe: -1688.424854 hartree
zpe.sumelectthermal: -1688.414093 hartree
zpe.sumelectthermalent: -1688.413149 hartree
zpe.sumelectthermalfe: -1688.463867 hartree
dipole: -2.9702 -0.5192 -0.2118
dipole: 3.0227
quadrupole: -81.1318 -94.2668 -76.5086
quadrupole: 1.8390 -0.3812 -1.3494
quadrupole: 2.8373 -10.2978 7.4605 1.8390 -0.3812 -1.3494
hfenergy: -1688.5513939 hartree
pointgroup: C01 [X(C8H7Cl3)]
dipole: -1.1641237 -0.2425017 0.0163017 debye
dipolederiv: -0.4061005 -0.0787266 0.0466018 -0.2160936 -0.4832758 0.2361055 0.2572778 0.2986705 -0.3463506 -0.7652826 -0.1243814 0.0276361 -0.1156594 -0.1873307 0.0322697 -0.0686024 0.0030263 -0.1116723 -0.2892557 -0.0503214 0.0339564 -0.0608332 -0.4941268 0.2711286 0.1021358 0.3040383 -0.328895 0.5637597 0.1613728 -0.0572134 0.1659452 0.4821456 -0.3068114 -0.1883878 -0.3207193 0.3834248 -0.1673205 -0.0345251 -0.0031312 0.0873011 -0.0766529 0.0427901 -0.0351843 0.0394786 -0.0545559 1.076349 0.1807062 -0.0325025 0.1842342 0.6696223 -0.3335992 -0.0132613 -0.2849573 0.4193854 -0.0459823 0.0683426 0.0651269 -0.0313018 -0.0860846 0.1057031 -0.0507651 0.0718181 0.0142939 -0.0272784 -0.0157215 -0.0914625 0.0781023 -0.0722953 0.0212277 -0.0375468 0.0566889 -0.0234061 -0.0281098 -0.043355 -0.1290014 -0.041819 -0.1066143 0.047067 -0.1410847 0.047592 0.0200238 -0.0929535 0.0458693 0.0825861 0.0606763 -0.0595694 0.1112478 0.093754 0.1211744 0.0390637 0.099365 0.0586792 -0.0057807 0.0581166 -0.1084476 0.0532237 -0.0080969 0.044017 -0.0561763 0.0623785 -0.0042144 0.023159 -0.0094062 0.0144772 0.0191881 -0.0201001 -0.0141613 -0.0457707 -0.0035474 -0.0444875 -0.0382213 -0.0155007 -0.0022801 0.0350566 -0.00388 -0.016306 -0.0313971 0.0634067 -0.060907 -0.0693257 -0.0505482 0.0750367 -0.0883339 -0.0443435 -0.0890533 0.0039926 0.0183162 0.0276237 0.10083 0.0103296 0.1046682 -0.0426675 0.1079612 -0.0517936 0.0279378 -0.0043563 0.0206797 0.0931601 0.0220915 0.1233439 -0.0705221 0.1074066 -0.0694416 -0.0000732 0.0529375 -0.0469088 -0.0433441 -0.0604182 0.0814881 -0.104044 -0.0561452 -0.1101018 -0.0174931 -0.1063257 -0.0597249 -0.0030738 -0.0652165 0.1258954 -0.0290296 -0.0011373 -0.0299699 0.1076683 unknown
polarizability: 147.5640411|18.7416034|88.0435542|-8.2234145|-2.2619302|98.0435229 unknown
InChI: InChI=1S/C8H7Cl3/c9-7(8(10)11)6-4-2-1-3-5-6/h1-5,7-8H
charge 0 multiplicity 1
18 atoms
Cl 1.546906 1.885311 -1.309663
Cl 3.863454 0.046217 0.220494
Cl 1.691749 -1.765653 1.333339
C  1.11375 0.668746 0.11821
C  -0.345015 0.289312 0.013847
C  2.098277 -0.501369 0.002556
C  -1.236336 0.690718 1.038731
C  -0.841612 -0.455218 -1.087578
C  -2.603596 0.341917 0.973993
C  -2.205748 -0.8038 -1.151543
C  -3.090856 -0.40795 -0.11991
H  1.323968 1.247257 1.030554
H  2.048788 -1.032537 -0.95563
H  -0.859912 1.269958 1.890073
H  -0.169445 -0.742839 -1.904179
H  -3.284513 0.655093 1.772592
H  -2.58288 -1.377335 -2.005149
H  -4.151177 -0.678231 -0.172436
