program: Gaussian 09
title: 000224756
version: EM64L-G09RevD.01
frameworkgroup: C1[X(C7H12O3)]
method: RPBEPBE
basis: SDD
operation: Freq
keyword: #pfreq=noraman
keyword: PBEPBE/SDD
title: #p freq=noraman PBEPBE/SDD
converged: YES YES NO NO
title: Mulliken charges:
elementType: O O O C C C C C C C H H H H H H H H H H H H
charge: -0.252989 -0.430329 -0.255962 -0.204145 0.214524 -0.205071 -0.264378 -0.660263 -0.116092 -0.737490 0.247594 0.239206 0.232932 0.226764 0.218211 0.230643 0.252127 0.230933 0.226165 0.228627 0.226949 0.352041
chargesum: 0.00000
title: Mulliken charges with hydrogens summed into heavy atoms:
elementType: O O O C C C C C C C
charge: -0.252989 -0.078288 -0.255962 0.043449 0.214524 0.034135 0.195319 0.040719 0.114841 -0.055749
polarizability: 1.00413014e+02 2.84484403e+00 8.66441975e+01 -2.69976861e+00 -4.04332503e+00 7.29391833e+01
1716.lowfreq: -14.4341 -9.4243 0.0008 0.0011 0.0012 6.3679 21.7478 49.7505 72.1183
frequency: 21.6641 49.7227 72.1100 95.8714 133.7717 151.5760 188.2255 191.6469 226.4268 281.9601 299.7301 329.8340 395.7707 424.7606 438.7446 549.6631 656.7429 744.5576 765.9452 811.1457 824.3583 849.0116 922.5220 958.0471 973.1440 1008.7932 1043.9580 1071.9169 1096.2196 1114.9426 1137.0989 1157.7736 1226.6288 1265.8060 1277.0956 1307.7563 1321.9927 1354.0297 1376.5854 1391.7789 1395.6797 1457.5950 1460.5363 1462.3832 1469.2604 1484.2434 1627.2689 1681.3966 2969.3076 2994.8376 3030.2559 3044.1840 3073.7848 3078.2360 3090.2225 3096.3501 3099.4041 3113.0204 3122.2837 3522.9819
redmass: 4.0761 2.8821 2.1188 3.1334 3.7681 2.7017 1.3488 1.6067 1.6984 2.6863 2.6142 4.0979 1.5252 3.2774 4.3210 3.3542 4.2688 4.2838 1.9306 1.4040 3.5243 2.6480 1.7874 4.1522 1.0897 2.7128 1.5639 2.7045 2.1572 2.3149 2.8825 1.7103 1.2826 1.5149 1.1220 1.2619 1.3559 1.2551 1.3219 1.2326 1.2347 1.0956 1.0472 1.0451 1.0593 1.0521 8.9772 5.8671 1.0367 1.0361 1.0600 1.0968 1.0851 1.0956 1.0974 1.1030 1.0964 1.0888 1.1060 1.0656
irintensity: 1.5834 0.7414 0.5675 0.1866 0.7706 3.4595 1.3132 1.0167 15.1855 1.6432 46.9467 15.2227 148.1471 7.0097 4.9239 17.6583 16.9096 8.0300 2.1612 2.4377 3.4397 8.0734 52.8594 70.9912 47.7308 54.3474 1.9402 56.6669 16.3012 3.0209 207.7821 31.5930 53.6823 22.9324 5.1831 12.2644 21.0155 7.0475 23.4756 19.7044 11.7957 11.1746 15.8411 13.7791 20.1227 12.8703 145.9061 7.0336 29.7922 18.2335 25.6596 22.5162 10.0801 7.9889 31.0602 0.4789 20.0480 31.3563 31.1336 10.4132
temp: 298.150 k
press: 1.00000 atm
elementType: 8 8 8 6 6 6 6 6 6 6 1 1 1 1 1 1 1 1 1 1 1 1
symmnumber: 1
zpe: 471224.4 jmol-1
zpe.correction: 0.179480 hartree
zpe.thermalcorrener: 0.191847 hartree
zpe.thermalcorrenthalpy: 0.192791 hartree
zpe.thermalcorrgfe: 0.139611 hartree
zpe.sumelectzpe: -498.786366 hartree
zpe.sumelectthermal: -498.773999 hartree
zpe.sumelectthermalent: -498.773055 hartree
zpe.sumelectthermalfe: -498.826235 hartree
dipole: 0.2660 -2.8301 -0.4534
dipole: 2.8785
quadrupole: -48.6928 -63.0970 -62.9497
quadrupole: -0.9682 -1.4614 0.0715
quadrupole: 9.5537 -4.8505 -4.7032 -0.9682 -1.4614 0.0715
hfenergy: -498.9658455 hartree
pointgroup: C01 [X(C7H12O3)]
dipole: -0.0527353 -1.097866 -0.2728216 debye
dipolederiv: -1.0100112 -0.4256363 0.1579387 -0.6486187 -0.8472726 0.3102903 0.1233398 0.2324841 -0.4787877 -0.7273925 0.0256906 0.1015038 0.0687668 -0.8073008 -0.1166699 0.0142195 0.0011001 -0.1801009 -0.5912483 0.0025093 -0.168712 -0.2129899 -0.5581008 0.1771719 0.0240819 0.361478 -0.6984226 0.3089938 -0.1349361 -0.1780541 -0.0755655 0.6310024 0.0247017 -0.1008577 -0.0278306 0.2567349 0.9592279 0.3287908 0.047795 0.7600121 0.8775863 -0.493064 -0.1720715 -0.6886733 0.826139 0.0072721 0.0621783 0.1157205 -0.028209 -0.2742814 0.0982123 0.1150217 0.0269619 -0.1481166 0.7349552 0.1900569 -0.0549639 0.1885531 0.4221054 -0.0350292 0.0966495 0.1115634 0.2247061 -0.1593617 0.0259832 0.0399561 0.0385415 -0.0575357 -0.0004381 0.0079867 -0.0602726 0.0523296 0.2093088 -0.0707532 -0.0978544 -0.0567926 -0.0870351 0.17339 -0.0711717 0.1878215 0.0706666 -0.0775835 0.0618061 0.0721447 0.0990461 0.0387924 -0.0729947 0.1293044 -0.0934165 -0.0093903 0.0507429 0.0203777 0.0412423 0.0180861 0.0190337 -0.0068622 0.0348919 0.0359426 -0.0683968 -0.1278054 -0.0275682 -0.0603194 -0.0350339 0.1380015 -0.0488772 -0.0255735 -0.0587153 0.0566369 -0.0098448 -0.0169189 0.0617429 -0.0059886 0.0793126 0.016613 -0.0119732 -0.0799744 -0.0921428 -0.0016233 0.0103593 -0.0011469 -0.0171602 -0.1241109 0.0479844 -0.0200771 0.0757133 0.0814527 -0.113843 -0.1107836 -0.0449958 -0.0949137 0.0542557 -0.055853 -0.0626344 -0.0499095 0.0802087 0.0943099 0.0221719 -0.0121137 0.0336643 0.0974853 -0.0072954 0.0470932 -0.0147644 -0.1345347 0.1167343 -0.0139321 0.0160246 0.0314416 -0.0794489 0.0538102 0.0136939 0.0753685 0.0673066 -0.0897123 -0.0233164 -0.0618784 -0.0425567 0.1087866 -0.0443228 -0.0825912 -0.0540315 0.0614521 -0.0707094 -0.0204982 -0.0503318 -0.0771389 0.0769119 -0.0567996 -0.1389197 -0.0503758 0.01251 0.0376008 0.0456317 0.05821 -0.0158392 0.0902488 0.0890373 0.0673772 0.0595281 -0.1202317 0.0452744 0.0159616 0.0493659 0.0473194 -0.1515129 -0.0417502 0.0061983 -0.010837 0.1172401 0.4147153 0.0328256 -0.0312742 0.0253758 0.3530765 -0.0112545 0.0060122 0.0208394 0.0227408 unknown
polarizability: 97.843855|1.8503796|81.4256854|-8.4984268|7.1377159|80.7268543 unknown
InChI: InChI=1S/C7H12O3/c1-3-5-6(8)7(9)10-4-2/h3,5-6,8H,4H2,1-2H3
charge 0 multiplicity 1
22 atoms
O  -1.141435 -1.064747 0.888363
O  0.633603 2.019276 0.875914
O  -1.028439 0.462387 -0.876746
C  0.659844 0.543285 0.918921
C  -0.580961 0.000186 0.200952
C  1.960978 0.007907 0.343229
C  -2.369839 -1.684368 0.289581
C  -3.622463 -0.92327 0.730235
C  2.096138 -0.735988 -0.785683
C  3.415606 -1.211997 -1.345832
H  0.586863 0.30457 1.992126
H  2.851622 0.312575 0.91031
H  -2.262434 -1.682388 -0.809485
H  -2.349023 -2.715713 0.67538
H  -4.523887 -1.441384 0.353606
H  -3.686731 -0.87412 1.830692
H  -3.620043 0.102425 0.325505
H  1.198266 -1.019416 -1.35526
H  4.266327 -0.87711 -0.72728
H  3.566293 -0.834955 -2.376089
H  3.445678 -2.317437 -1.404977
H  0.571937 2.284781 -0.08026
