program: Gaussian 09
title: 000019125
version: EM64L-G09RevD.01
frameworkgroup: C1[X(C20H27NO2)]
method: RPBEPBE
basis: SDD
operation: Freq
keyword: #p
keyword: freq=noraman
keyword: PBEPBE/SDD
title: #p freq=noraman PBEPBE/SDD
converged: YES YES NO NO
title: Mulliken charges:
elementType: O O N C C C C C C C C C C C C C C C C C C C C H H H H H H H H H H H H H H H H H H H H H H H H H H H
charge: -0.258989 -0.239668 -0.082469 -0.263105 -0.115222 0.171121 -0.533487 -0.568616 -0.463395 -0.484094 0.328965 0.175515 -0.362333 -0.394901 -0.286206 -0.243138 -0.247558 -0.352617 -0.251918 -0.360684 -0.356535 -0.440115 -0.449620 0.277519 0.230195 0.238275 0.225126 0.265987 0.211464 0.236269 0.217116 0.206998 0.227371 0.264539 0.253054 0.240430 0.225338 0.217623 0.224362 0.170685 0.228315 0.227250 0.173688 0.227878 0.234286 0.181373 0.227004 0.207436 0.208480 0.231008
chargesum: 0.00000
title: Mulliken charges with hydrogens summed into heavy atoms:
elementType: O O N C C C C C C C C C C C C C C C C C C C C
charge: -0.258989 -0.239668 -0.082469 0.014413 0.114973 0.171121 -0.070086 -0.091165 -0.010010 -0.049726 0.328965 0.175515 -0.097794 -0.141847 0.179561 -0.025515 -0.023196 0.046383 -0.024667 0.040882 0.059125 -0.005674 -0.010132
polarizability: 2.33568151e+02 1.18858258e+01 2.27693725e+02 -1.57459887e+01 5.85804195e+00 1.81615921e+02
1716.lowfreq: -20.6243 -0.0005 -0.0002 0.0004 4.1844 6.2841 9.3712 12.6833 27.3288
frequency: -20.1358 10.0434 26.7687 40.7575 45.2387 49.7804 72.5257 93.2457 104.7770 134.1478 143.7599 171.3712 213.8509 227.5733 250.2607 256.6547 273.0734 301.0793 322.5369 327.2098 357.5174 398.3693 406.2910 438.8855 478.1227 490.3294 511.0616 567.8064 574.6677 615.6433 630.6383 637.0421 692.5419 706.5390 729.8344 736.0486 757.6545 773.6570 776.9769 802.5593 814.2827 839.5122 841.8780 849.7796 851.1263 880.7979 891.6457 899.3081 917.5131 935.4740 938.2672 941.0371 952.4372 958.6339 964.4313 971.8117 974.3880 979.9095 990.1657 990.5670 995.7538 1007.9330 1030.6421 1041.1567 1063.2776 1065.6814 1067.7478 1078.4455 1088.8119 1094.0219 1112.7896 1115.6919 1144.5879 1155.0856 1160.6447 1167.0911 1172.5416 1185.1619 1188.1385 1190.4391 1198.9456 1209.6603 1212.9019 1222.9601 1234.3252 1243.1185 1248.2350 1253.7103 1263.5054 1267.1082 1286.2179 1290.1548 1290.7394 1292.6410 1309.4794 1313.2475 1320.8393 1324.8151 1344.4179 1363.9624 1376.1008 1387.5629 1432.9380 1450.1511 1463.4805 1469.2553 1474.1017 1474.7300 1476.9758 1477.7695 1479.6932 1482.0393 1494.8105 1495.7347 1586.8693 1603.5456 1613.7856 2799.7532 2821.8512 2838.2221 2994.6115 3007.7162 3010.4139 3010.6803 3013.7223 3020.6169 3021.9646 3022.9921 3032.9511 3048.1770 3052.2954 3058.5913 3065.8210 3073.7949 3075.3093 3081.5858 3085.1594 3090.9996 3091.8290 3119.0427 3129.1881 3145.0328 3153.9563 3163.8194
redmass: 2.0402 3.2556 3.4459 4.8713 2.9027 3.8102 5.3000 4.2598 3.4990 3.2427 3.8949 3.3897 3.3774 3.8069 3.7718 2.5489 2.7651 4.1760 3.1249 2.2258 3.3311 2.3520 2.5472 2.2527 3.0551 3.3959 3.3292 2.8359 4.7946 6.4120 4.8313 2.9971 4.0880 1.8672 3.5384 1.4575 3.2580 3.5445 2.5988 1.8177 2.2005 2.4814 2.3672 1.4281 1.3206 2.7654 2.5948 2.7957 1.4712 2.6915 1.9882 2.6488 1.6942 2.0149 1.8230 1.9086 1.4805 1.7806 3.6092 1.5338 2.2041 2.4335 2.1198 2.4873 1.7607 1.8406 2.4289 2.2940 1.5241 1.5921 1.2003 1.4671 2.4487 2.3005 1.8568 1.7709 1.1481 1.6554 1.2319 1.3438 1.1730 2.0323 1.3952 1.5932 1.3805 1.4723 1.4794 1.4539 1.2290 1.3408 1.2297 1.7520 1.3386 1.4872 1.5788 1.4757 1.4202 1.3691 1.4867 1.3464 6.6608 1.5369 2.2559 1.0896 1.0816 1.0898 1.0950 1.0828 1.0842 1.1815 1.0874 1.7696 1.1047 1.1069 5.9357 7.6744 8.0015 1.0713 1.0714 1.0708 1.0601 1.0597 1.0595 1.0595 1.0638 1.0627 1.0714 1.0827 1.0823 1.0884 1.1019 1.0903 1.1047 1.1054 1.1051 1.1023 1.0912 1.1053 1.1011 1.0846 1.0883 1.0928 1.0950 1.1005
irintensity: 0.0936 0.2393 0.2579 0.8003 0.8226 0.0472 0.6039 0.0292 0.8063 0.5492 2.4929 0.6993 1.3684 1.5841 2.2255 6.1416 0.4173 0.9000 0.5147 14.1948 0.7696 0.1500 0.0338 1.2050 5.4057 4.7995 7.2440 11.4322 2.0396 0.0915 12.8479 0.1985 6.2362 65.0088 6.8462 2.0853 3.2634 5.4576 14.3463 8.3877 2.3224 10.5691 13.1168 2.5846 1.4909 10.9719 8.0522 2.8767 1.2593 3.8843 11.5815 1.4920 3.4374 2.5497 2.0732 2.1099 1.0539 4.6489 1.4243 1.9620 0.8607 36.3251 15.4117 51.7425 37.6369 46.9479 16.5926 38.2332 6.8363 2.3556 69.2355 58.1461 5.3031 49.9626 29.1062 81.7853 20.1114 12.5137 2.7497 5.8921 1.2996 3.1710 8.5440 1.9609 6.6580 8.0126 3.3427 17.3274 14.6186 1.6519 3.3321 1.9331 5.1418 4.4364 3.6109 3.2876 5.1920 0.6063 8.0218 4.7507 0.0824 2.6181 7.8154 8.2735 1.4980 1.9629 17.9101 12.9169 3.5925 16.6315 11.4144 14.2755 4.0647 10.1039 0.8516 87.3494 79.3374 75.0518 74.9602 245.3929 37.6782 40.4761 23.3589 29.5808 52.1646 15.9291 36.3704 37.6393 64.3825 12.5520 12.5987 65.8443 0.8866 22.3137 31.4987 59.4256 19.2560 80.9650 27.6460 2.2785 11.4335 30.7700 23.6479 11.8505
temp: 298.150 k
press: 1.00000 atm
elementType: 8 8 7 6 6 6 6 6 6 6 6 6 6 6 6 6 6 6 6 6 6 6 6 1 1 1 1 1 1 1 1 1 1 1 1 1 1 1 1 1 1 1 1 1 1 1 1 1 1 1
symmnumber: 1
zpe: 1126978.4 jmol-1
zpe.correction: 0.429243 hartree
zpe.thermalcorrener: 0.449641 hartree
zpe.thermalcorrenthalpy: 0.450585 hartree
zpe.thermalcorrgfe: 0.377499 hartree
zpe.sumelectzpe: -981.765732 hartree
zpe.sumelectthermal: -981.745334 hartree
zpe.sumelectthermalent: -981.744390 hartree
zpe.sumelectthermalfe: -981.817476 hartree
dipole: 2.0830 -0.3048 -1.2768
dipole: 2.4621
quadrupole: -124.3493 -130.4578 -142.9084
quadrupole: -1.7297 1.2362 3.6035
quadrupole: 8.2225 2.1140 -10.3366 -1.7297 1.2362 3.6035
hfenergy: -982.194975 hartree
pointgroup: C01 [X(C20H27N1O2)]
dipole: -0.8018948 0.0658521 -0.5393943 debye
polarizability: 233.6051785|14.2821744|223.8785088|14.7753776|-12.6763771|185.3941102 unknown
InChI: InChI=1S/C20H27NO2/c22-19(23-13-12-21-10-4-5-11-21)20(17-6-2-1-3-7-17)15-16-8-9-18(20)14-16/h1-3,6-7,16,18H,4-5,8-15H2
charge 0 multiplicity 1
50 atoms
O  -0.388365 1.585447 0.142757
O  0.855577 1.547035 2.105737
N  -3.25421 1.009647 -0.406021
C  3.126475 0.472148 0.649785
C  3.282825 1.212459 -1.504024
C  1.662965 0.276473 0.114919
C  3.528866 1.786988 -0.079713
C  1.810862 0.711085 -1.403089
C  4.085767 -0.558003 -0.024599
C  4.223354 -0.0274 -1.500356
C  1.037168 -1.119095 0.330976
C  0.716952 1.211347 0.905571
C  -0.046589 -1.548712 -0.479468
C  1.461626 -1.959278 1.392906
C  -1.48945 2.276523 0.865079
C  -0.660449 -2.801306 -0.259816
C  0.848785 -3.213219 1.613492
C  -2.70206 2.328768 -0.063153
C  -0.210836 -3.64426 0.782945
C  -4.376445 1.062903 -1.376696
C  -3.755483 0.190408 0.726774
C  -4.940705 -0.381099 -1.369529
C  -4.532449 -0.957778 0.029516
H  3.180641 0.501916 1.748634
H  3.452049 1.90464 -2.345633
H  2.881442 2.64543 0.173706
H  4.58173 2.069806 0.098352
H  1.088745 1.501486 -1.662177
H  1.631255 -0.142881 -2.079617
H  3.695175 -1.588384 0.013763
H  5.061497 -0.553915 0.49475
H  3.916157 -0.778456 -2.250329
H  5.26501 0.266137 -1.727108
H  -0.43622 -0.885806 -1.259085
H  2.268075 -1.63187 2.057247
H  -1.690607 1.732722 1.805162
H  -1.15652 3.298203 1.126437
H  -1.493574 -3.115192 -0.899872
H  1.196642 -3.84993 2.435021
H  -3.465121 2.98334 0.443891
H  -2.413364 2.838487 -1.001822
H  -0.685697 -4.617369 0.952477
H  -5.169424 1.786344 -1.048682
H  -4.016767 1.385538 -2.370507
H  -2.921719 -0.184406 1.344673
H  -4.442013 0.781542 1.388837
H  -4.484956 -0.977425 -2.178211
H  -6.033815 -0.385455 -1.524131
H  -5.406102 -1.269892 0.627834
H  -3.877599 -1.837293 -0.092205
