program: Gaussian 09
title: 000224811
version: EM64L-G09RevD.01
frameworkgroup: C1[X(C20H31N3O2)]
method: RPBEPBE
basis: SDD
operation: Freq
keyword: #p
keyword: freq=noraman
keyword: PBEPBE/SDD
title: #p freq=noraman PBEPBE/SDD
converged: YES YES NO NO
title: Mulliken charges:
elementType: O O N N N C C C C C C C C C C C C C C C C C C C C H H H H H H H H H H H H H H H H H H H H H H H H H H H H H H H
charge: -0.299195 -0.269047 -0.107254 -0.413283 -0.063284 -0.376583 -0.396513 -0.243576 -0.322598 -0.330392 -0.432702 -0.229700 -0.363031 -0.674605 -0.668349 0.439833 -0.240715 0.539733 -0.567263 0.346832 -0.628030 -0.344927 -0.183288 -0.394272 -0.544859 0.184397 0.229319 0.190617 0.205022 0.211757 0.188733 0.187409 0.202475 0.199347 0.197680 0.215150 0.197956 0.188705 0.205890 0.231436 0.216129 0.222847 0.210279 0.204068 0.210154 0.233209 0.213526 0.322179 0.246568 0.254587 0.243937 0.224077 0.237439 0.220411 0.228064 0.243702
chargesum: 0.00000
title: Mulliken charges with hydrogens summed into heavy atoms:
elementType: O O N N N C C C C C C C C C C C C C C C C C C C C
charge: -0.299195 -0.269047 -0.107254 -0.091104 -0.063284 0.037132 -0.000874 0.156914 0.067286 0.066635 -0.019596 0.164895 0.084535 -0.037412 -0.011461 0.439833 -0.240715 0.539733 -0.320695 0.346832 -0.373443 -0.100989 0.040790 -0.156833 0.147319
polarizability: 2.66875237e+02 -1.17000848e+01 2.64848827e+02 -5.86615329e+01 -1.12199678e+01 2.37906098e+02
1716.lowfreq: -8.8776 -4.9528 0.0006 0.0009 0.0009 8.3250 10.5731 13.5852 21.8450
frequency: 10.2874 13.5298 21.7272 31.1161 39.2118 52.5243 70.2306 71.6171 86.7004 100.1432 109.6843 125.6585 140.5563 148.9495 159.5277 183.4496 190.4963 204.5738 209.1893 215.1890 237.2643 258.5050 261.3428 276.4540 299.7382 302.2860 312.3167 345.0177 373.2501 373.9998 418.1954 431.5698 437.2506 439.9010 459.4257 482.5211 506.4654 514.4054 532.2405 590.1277 616.4073 619.1500 632.9807 649.1055 699.0264 702.7596 761.8522 768.4115 783.0670 791.6719 792.3916 794.1676 818.6864 824.5216 857.3196 866.1434 872.0782 880.2151 889.0814 916.6614 921.0601 929.0325 958.8882 975.5306 981.0181 1000.0886 1013.2640 1030.2243 1039.1671 1057.2817 1072.3283 1073.3390 1074.5661 1083.1777 1085.4244 1098.1608 1110.4392 1112.1395 1116.5292 1121.6577 1144.7903 1159.6890 1162.7771 1172.0501 1185.8614 1203.6612 1209.6784 1221.5776 1222.5120 1237.9172 1249.8390 1277.5767 1283.6338 1287.9632 1294.6040 1303.4299 1332.3573 1347.1598 1349.3363 1355.8718 1356.9917 1359.7917 1362.8041 1370.5768 1378.3450 1385.9142 1387.6052 1396.6130 1411.0572 1423.0968 1441.8210 1442.9495 1449.5437 1457.6024 1458.1000 1462.7903 1467.6965 1469.0704 1471.1171 1471.9147 1476.1974 1478.4104 1481.7967 1485.4510 1487.1223 1489.7358 1492.3981 1525.8662 1574.3042 1592.6160 1624.7489 2847.1313 2855.8202 2870.7955 2926.4761 2936.6390 2938.1434 2956.2519 2976.8956 2982.4782 2984.2123 2987.0174 2991.5311 3001.6020 3017.5373 3030.8713 3034.9283 3043.7565 3050.1208 3052.2025 3064.9456 3075.1730 3079.9206 3089.4508 3089.8433 3120.0464 3124.6798 3132.5889 3162.1107 3164.0236 3175.2983 3441.2307
redmass: 4.9841 4.6881 3.9210 3.6657 3.6707 4.0207 3.2729 3.0788 2.7976 3.5063 2.4578 4.1406 3.1221 2.5269 2.9642 2.7341 2.4732 1.9999 1.2680 1.6811 2.2981 2.0539 1.9188 1.9103 3.6249 2.1545 4.0155 2.0679 3.2810 3.6011 2.6680 4.8393 3.6335 2.1648 2.4954 2.6868 3.8982 3.1421 3.8525 4.4244 4.8578 4.1670 5.4751 2.1886 2.5946 1.1632 3.4683 2.1888 1.2768 1.3728 1.2480 1.8116 1.7292 1.6502 2.2717 3.5876 3.7930 1.9551 2.4840 2.1242 1.4781 4.0033 1.8685 2.2651 1.3649 2.4213 3.5856 2.2939 2.3367 2.6197 2.0430 2.2358 2.2722 2.0344 2.1472 2.8182 1.2800 2.1344 1.9078 1.8112 1.5567 1.5563 1.6796 1.5878 1.3718 1.2936 1.7408 1.5040 1.7163 1.5945 1.4369 1.1329 1.2941 1.2709 1.2285 2.1992 1.2477 1.5224 1.8780 1.4004 1.4580 1.3673 1.3518 1.3768 2.1665 1.2279 1.2342 1.4327 2.9662 1.7384 1.1246 1.5510 1.4419 1.6975 1.1517 1.0569 1.0527 1.2452 1.0937 1.4818 1.3378 1.1705 1.0780 1.0802 1.0769 1.0758 1.0818 3.1211 5.1807 6.0100 6.5592 1.0718 1.0716 1.0712 1.0554 1.0696 1.0573 1.0330 1.0984 1.0357 1.0359 1.0744 1.0706 1.0902 1.0867 1.0873 1.0903 1.1037 1.0970 1.0987 1.0930 1.0984 1.0987 1.1003 1.0999 1.0991 1.0870 1.0915 1.0932 1.0981 1.0894 1.0756
irintensity: 0.0028 0.0457 0.0174 0.1230 0.2065 0.2242 3.5497 2.4792 2.5609 0.7904 1.2751 5.3637 10.5788 2.7576 1.2489 1.2373 0.9528 3.6206 1.0742 5.5307 1.3068 3.3931 1.7740 1.9479 1.6386 0.2736 1.8270 1.0132 2.5571 2.1145 5.0208 4.3740 2.7593 3.5026 4.3565 1.6071 5.1323 4.0487 0.3488 4.2775 0.5127 1.3443 7.6785 10.9944 10.5048 122.1416 2.5679 3.9828 16.5013 28.3118 11.3992 11.2908 0.0592 1.0125 92.4788 1.9574 8.7024 4.1690 6.6980 3.3402 4.0718 10.0327 21.3299 12.2674 1.4796 43.9396 27.6638 23.6068 4.2577 25.0975 16.3807 25.1774 28.5685 5.2847 3.4111 44.3264 0.5207 0.9583 10.1083 56.5412 15.7454 78.4748 37.2500 19.5224 18.5590 38.7627 9.4549 30.9719 18.7851 44.7838 14.3705 1.2577 27.1552 25.9104 11.8712 14.7396 11.5332 9.0473 11.1026 4.9299 11.9961 6.7838 0.1225 3.1594 2.3677 5.9589 24.2215 5.1554 34.2038 82.8503 12.7646 3.4499 23.5685 58.5506 6.4225 6.9919 7.0450 6.4521 5.4031 15.2637 55.1743 13.5572 10.4741 6.0390 31.4781 29.7302 8.4049 103.3440 200.2933 119.2701 241.9786 47.6969 67.8447 187.5428 23.3847 96.0003 87.3228 65.5503 37.3684 37.3756 22.7910 10.0522 89.8421 70.7235 18.9092 28.0485 20.5449 52.6915 37.5883 50.1534 25.2833 57.8293 33.7580 40.8142 49.6920 27.8061 4.9624 20.4197 9.1604 35.2432 10.3733 47.9926
temp: 298.150 k
press: 1.00000 atm
elementType: 8 8 7 7 7 6 6 6 6 6 6 6 6 6 6 6 6 6 6 6 6 6 6 6 6 1 1 1 1 1 1 1 1 1 1 1 1 1 1 1 1 1 1 1 1 1 1 1 1 1 1 1 1 1 1 1
symmnumber: 1
zpe: 1260658.9 jmol-1
zpe.correction: 0.480160 hartree
zpe.thermalcorrener: 0.507009 hartree
zpe.thermalcorrenthalpy: 0.507953 hartree
zpe.thermalcorrgfe: 0.419573 hartree
zpe.sumelectzpe: -1093.462470 hartree
zpe.sumelectthermal: -1093.435621 hartree
zpe.sumelectthermalent: -1093.434677 hartree
zpe.sumelectthermalfe: -1093.523057 hartree
dipole: -1.7175 0.8698 0.2195
dipole: 1.9377
quadrupole: -148.3234 -144.2348 -144.8832
quadrupole: 0.0621 -8.6727 0.3859
quadrupole: -2.5096 1.5790 0.9306 0.0621 -8.6727 0.3859
hfenergy: -1093.9426296 hartree
pointgroup: C01 [X(C20H31N3O2)]
dipole: -0.7295604 0.20621 -0.0798276 debye
polarizability: 265.2305511|-53.5712627|227.5195678|-20.4817767|3.2242063|276.8800431 unknown
InChI: InChI=1S/C20H31N3O2/c1-4-23(5-2)12-8-14-25-13-7-11-21-19-16-18(24-3)15-17-9-6-10-22-20(17)19/h6,9-10,15-16,21H,4-5,7-8,11-14H2,1-3H3
charge 0 multiplicity 1
56 atoms
O  -2.771158 1.571483 -1.367226
O  1.589865 1.17164 3.094487
N  -2.974471 -1.283406 1.370187
N  0.872485 1.632544 -1.789606
N  2.810056 -0.1845 -2.215847
C  -2.997695 0.203576 1.359681
C  -4.127504 0.765979 0.466096
C  -3.813377 0.586141 -1.021964
C  -3.94513 -1.85595 2.341007
C  -1.600802 -1.844024 1.510125
C  -1.172341 2.472155 -2.938511
C  -2.102893 1.288171 -2.643246
C  -0.124105 2.7027 -1.827119
C  -4.394106 -3.283981 1.975874
C  -0.823006 -1.840655 0.181006
C  1.494964 1.127646 -0.667018
C  2.52962 0.129404 -0.900571
C  3.206332 -0.478642 0.222865
C  1.189374 1.494416 0.6623
C  1.867381 0.86539 1.750252
C  2.861874 -0.105516 1.552675
C  4.212385 -1.454988 -0.093029
C  4.489737 -1.767318 -1.426209
C  3.762972 -1.105126 -2.465736
C  0.534021 2.144054 3.381303
H  -3.094912 0.615063 2.396293
H  -2.035631 0.570307 0.957553
H  -5.083339 0.258824 0.701066
H  -4.269339 1.845974 0.668352
H  -3.448634 -0.447542 -1.201413
H  -4.709643 0.767346 -1.654314
H  -3.535087 -1.843245 3.383687
H  -4.836549 -1.200318 2.352246
H  -1.016012 -1.295121 2.290548
H  -1.691562 -2.886621 1.866399
H  -1.783635 3.388901 -3.037285
H  -0.668747 2.306251 -3.912436
H  -2.853188 1.178446 -3.457372
H  -1.528949 0.339091 -2.563729
H  -0.662704 2.738925 -0.865082
H  0.361669 3.691619 -1.977414
H  -4.855276 -3.29243 0.972738
H  -3.545538 -3.991621 1.964097
H  -5.131995 -3.658339 2.71033
H  -1.34371 -2.466466 -0.565666
H  -0.726445 -0.820011 -0.22939
H  0.200109 -2.234155 0.328073
H  1.268045 1.269406 -2.666754
H  0.431961 2.257123 0.85485
H  3.356979 -0.55532 2.417841
H  4.755087 -1.94599 0.72309
H  5.252887 -2.507402 -1.687712
H  3.964057 -1.33139 -3.519145
H  0.781509 3.14441 2.975804
H  -0.44349 1.811191 2.979969
H  0.485102 2.1943 4.479295
