program: Gaussian 09
title: 000019123
version: EM64L-G09RevD.01
frameworkgroup: C1[X(C19H24O3)]
method: RPBEPBE
basis: SDD
operation: Freq
keyword: #pfreq=noraman
keyword: PBEPBE/SDD
title: #p freq=noraman PBEPBE/SDD
converged: YES YES NO NO
title: Mulliken charges:
elementType: O O O C C C C C C C C C C C C C C C C C C C H H H H H H H H H H H H H H H H H H H H H H H H
charge: -0.395772 -0.156850 -0.136886 -0.005179 -0.427808 -0.405603 -0.609557 -0.373165 -0.746787 0.248706 -0.345437 -0.357708 -0.014117 -0.164829 0.332780 0.298242 -0.213228 -0.695087 -0.379764 -0.375683 -0.222123 -0.232951 0.258095 0.223252 0.163605 0.194370 0.201548 0.188448 0.266062 0.190805 0.202706 0.227960 0.203594 0.226521 0.185957 0.183603 0.196017 0.197131 0.216971 0.208756 0.209214 0.287749 0.291419 0.373471 0.239403 0.242150
chargesum: 0.00000
title: Mulliken charges with hydrogens summed into heavy atoms:
elementType: O O O C C C C C C C C C C C C C C C C C C C
charge: -0.022302 -0.156850 -0.136886 0.252916 -0.040952 -0.009685 -0.155047 0.020346 -0.088712 0.248706 0.024124 0.035440 -0.014117 -0.164829 0.332780 0.298242 -0.213228 -0.060147 -0.092014 -0.084264 0.017280 0.009198
polarizability: 2.41565219e+02 -5.31894680e+01 1.97038414e+02 -2.72685324e+01 3.64052624e+00 2.26193847e+02
1716.lowfreq: -9.1608 -6.3890 -0.0003 0.0004 0.0005 7.3905 12.6536 19.7362 31.7105
frequency: 11.6590 18.1020 31.4621 45.3881 55.8388 65.7375 69.5616 91.2893 110.1955 123.9665 129.6471 162.7465 183.1022 196.8052 230.9152 233.7713 255.7168 261.9330 278.9004 324.7020 330.7507 355.1059 357.7613 360.9397 402.4185 407.9268 411.3272 419.8208 431.3369 464.0007 483.1291 504.4383 530.6084 573.7267 626.6959 651.4697 675.7135 684.8174 720.7805 730.3915 737.2627 775.0738 789.5732 798.3996 839.0593 858.9292 868.4965 887.5609 897.7722 920.6100 929.2063 933.7010 959.7887 966.9389 990.3898 999.5748 1010.1132 1024.6946 1037.3766 1039.8012 1069.1053 1076.0578 1083.0131 1084.5498 1112.1536 1132.9307 1141.6405 1156.5897 1174.0296 1184.7297 1192.5828 1201.6283 1223.3073 1239.4006 1255.5403 1270.2820 1279.4627 1286.0306 1286.3715 1289.3527 1303.6947 1309.3956 1313.7576 1344.0628 1348.0609 1352.8734 1358.6532 1383.5639 1388.6096 1389.4460 1394.9561 1438.5749 1459.2958 1462.5564 1465.2798 1467.8615 1471.3929 1476.6541 1477.7243 1478.9180 1484.9678 1486.1252 1491.2996 1534.2250 1572.1845 1581.7731 1609.2010 1616.2974 2911.4412 2926.7960 2949.9114 2957.8976 2967.3552 2969.7406 2971.1730 2972.3088 2987.7642 2992.2158 3002.2766 3012.4122 3023.4240 3035.0860 3039.9384 3063.9133 3067.4696 3071.0900 3079.8009 3138.6489 3152.4074 3166.7275 3182.0860 3536.5018
redmass: 3.5355 6.1695 1.7881 4.2202 9.4411 4.5596 2.8662 3.0415 3.4533 1.9243 4.4162 3.0595 4.1654 1.2949 4.1407 1.1142 2.8340 3.7471 2.4748 3.2045 2.8167 5.5641 3.5020 9.5391 6.8728 3.3117 2.0221 2.4218 2.9221 5.8885 1.8540 4.0892 3.1917 4.0341 6.2463 5.5516 4.5653 5.0682 1.1489 2.2505 1.6531 1.7689 1.4646 1.9799 1.9587 1.6286 2.4185 1.8439 2.1662 1.9328 1.9784 2.9753 1.4212 1.7969 1.4007 3.8385 1.3663 3.1059 2.1820 1.6230 2.2506 2.8161 2.3480 2.1114 1.8866 2.3107 2.1938 2.1030 1.0874 1.5479 1.5219 1.5317 2.5123 1.4431 1.2729 1.3144 1.5629 1.0927 1.4614 1.1558 1.7811 1.6334 1.3342 1.4367 1.4768 1.5576 1.5731 2.5536 1.2175 1.2156 9.9055 2.4220 1.0742 1.0723 1.1213 1.1093 1.0745 1.0772 1.0444 1.0710 2.4739 1.1121 1.0789 9.3770 8.9079 7.3837 8.0740 7.9960 1.0651 1.0678 1.0588 1.0599 1.0571 1.0449 1.0383 1.0537 1.0965 1.0884 1.0951 1.0933 1.1022 1.0914 1.1037 1.0975 1.1008 1.0993 1.0988 1.0864 1.0912 1.0973 1.0967 1.0648
irintensity: 0.0822 2.9930 0.2747 0.3754 0.2491 0.8781 0.0973 0.5147 0.4078 0.0847 1.3680 0.1927 0.8326 0.1734 0.8999 0.0208 1.4195 0.9648 1.5249 0.6995 2.3701 8.4962 1.5414 4.3295 5.4956 8.4139 2.2706 71.3899 8.9395 9.3036 64.0863 4.4702 0.3880 4.1316 5.2201 3.8041 5.0259 24.1906 16.0732 8.6269 0.7796 3.2488 58.0937 4.6413 3.5058 2.2672 3.3823 6.0489 25.6727 2.1710 0.2747 25.6856 0.8682 2.7331 4.7223 23.7816 0.0232 0.4562 2.9455 4.1037 3.7710 8.1813 7.7234 17.6737 4.1292 17.4076 12.9155 11.7586 8.8462 76.8168 45.3338 1.6150 33.7475 22.3263 0.2739 8.5388 9.7154 1.0002 19.4779 4.8223 23.2620 29.2737 2.4157 5.7118 6.1505 2.6603 2.2665 47.4724 12.1278 18.8380 3.1417 9.1362 2.5783 0.9162 3.9743 2.7906 5.3931 20.3235 9.9418 2.5272 39.9122 10.1501 10.8210 257.7875 18.3258 73.8330 40.3010 6.9522 49.7109 41.9633 6.5013 6.7380 14.1883 42.8523 26.9215 126.7462 1.4586 6.5520 4.6885 33.9699 4.4128 1.6095 108.6950 36.5796 94.4100 50.2360 40.3096 3.5159 5.5701 18.2248 7.5419 58.9955
temp: 298.150 k
press: 1.00000 atm
elementType: 8 8 8 6 6 6 6 6 6 6 6 6 6 6 6 6 6 6 6 6 6 6 1 1 1 1 1 1 1 1 1 1 1 1 1 1 1 1 1 1 1 1 1 1 1 1
symmnumber: 1
zpe: 1008735.9 jmol-1
zpe.correction: 0.384207 hartree
zpe.thermalcorrener: 0.406791 hartree
zpe.thermalcorrenthalpy: 0.407736 hartree
zpe.thermalcorrgfe: 0.329377 hartree
zpe.sumelectzpe: -962.442030 hartree
zpe.sumelectthermal: -962.419446 hartree
zpe.sumelectthermalent: -962.418502 hartree
zpe.sumelectthermalfe: -962.496861 hartree
dipole: 0.0725 0.3605 -6.0177
dipole: 6.0289
quadrupole: -121.0688 -124.7950 -147.8928
quadrupole: -8.7671 -11.1514 -0.8136
quadrupole: 10.1834 6.4572 -16.6406 -8.7671 -11.1514 -0.8136
hfenergy: -962.8262374 hartree
pointgroup: C01 [X(C19H24O3)]
dipole: -0.0184172 0.2826347 -2.3549902 debye
polarizability: 242.3803237|-56.7751552|198.243062|17.513128|-8.6783151|224.1740942 unknown
InChI: InChI=1S/C19H24O3/c1-3-4-5-6-9-13(2)12-16-17(20)14-10-7-8-11-15(14)18(21)19(16)22/h7-8,10-11,13,20H,3-6,9,12H2,1-2H3
charge 0 multiplicity 1
46 atoms
O  -1.271834 -0.98451 -2.29585
O  -0.494632 -1.550192 2.439175
O  -2.441647 0.403448 2.951301
C  1.70634 -1.929189 -0.171013
C  1.972243 -0.963618 -1.357084
C  3.39299 -0.34789 -1.41962
C  0.22684 -2.433061 -0.168266
C  3.768002 0.50671 -0.18661
C  2.658655 -3.146847 -0.185918
C  -0.813895 -1.354731 0.069683
C  5.123817 1.230643 -0.349556
C  5.519302 2.074652 0.883561
C  -1.506172 -0.715539 -0.949396
C  -1.100322 -0.999179 1.467242
C  -2.552524 0.299828 -0.736335
C  -2.886389 0.691326 0.594637
C  -2.18349 0.078664 1.7597
C  6.872324 2.798022 0.709538
C  -3.228108 0.896421 -1.828649
C  -3.887037 1.66737 0.813271
C  -4.227632 1.867626 -1.59853
C  -4.559861 2.255764 -0.278277
H  1.855258 -1.380077 0.779228
H  1.23967 -0.131606 -1.317635
H  1.791101 -1.517634 -2.307923
H  3.456687 0.289609 -2.325689
H  4.148312 -1.14756 -1.556258
H  0.034857 -2.994953 -1.11056
H  0.127026 -3.166155 0.653592
H  2.970536 1.257401 -0.003576
H  3.807072 -0.130889 0.719695
H  3.716007 -2.838505 -0.108317
H  2.545051 -3.727647 -1.122655
H  2.445547 -3.822769 0.662296
H  5.918832 0.481555 -0.549977
H  5.084068 1.886987 -1.244472
H  4.722946 2.819904 1.085199
H  5.561627 1.417778 1.776212
H  7.132327 3.39265 1.604538
H  6.845694 3.485606 -0.157106
H  7.689994 2.072885 0.536185
H  -2.965046 0.59428 -2.845362
H  -4.118099 1.946565 1.846523
H  -0.515168 -1.617923 -2.399542
H  -4.746824 2.322535 -2.448821
H  -5.334743 3.009643 -0.10528
