program: Gaussian 09
title: 000224708
version: EM64L-G09RevD.01
frameworkgroup: C1[X(C9H12INO2)]
method: RPBEPBE
basis: SDD
operation: Freq
keyword: #p
keyword: freq=noraman
keyword: PBEPBE/SDD
title: #p freq=noraman PBEPBE/SDD
converged: YES YES NO NO
title: Mulliken charges:
elementType: I O O N C C C C C C C C C H H H H H H H H H H H H
charge: 0.109112 -0.285131 -0.287853 -0.366312 -0.081151 0.273440 0.431951 -0.424699 -0.796116 -0.770451 0.183210 -0.255649 -0.668164 0.327421 0.227895 0.233858 0.310854 0.241650 0.214083 0.240621 0.233338 0.217908 0.214097 0.223399 0.252688
chargesum: 0.00000
title: Mulliken charges with hydrogens summed into heavy atoms:
elementType: I O O N C C C C C C C C C
charge: 0.109112 -0.285131 -0.287853 -0.038891 -0.081151 0.273440 0.431951 -0.424699 -0.023508 -0.074098 0.183210 0.195597 0.022020
polarizability: 2.00598360e+02 -1.88170906e+00 1.38017831e+02 3.22764778e+00 2.93658067e+00 6.97407439e+01
1716.lowfreq: -10.7848 -4.0170 0.0005 0.0007 0.0008 5.4498 12.9297 39.5261 46.8393
frequency: 12.5832 39.3768 46.8123 79.7424 102.3500 106.0632 138.6313 147.2497 179.9393 208.5248 230.0099 254.8070 274.6788 305.2449 306.7017 345.4148 410.8616 456.2921 535.5242 588.0918 599.0515 616.2200 632.3934 726.4567 744.5297 763.8603 815.7742 831.1397 981.4069 998.5147 1021.8515 1041.8208 1043.6262 1047.6418 1054.6436 1096.3490 1154.0946 1185.3320 1240.3994 1281.2388 1319.6391 1355.1810 1375.7054 1390.4837 1397.5967 1409.1606 1420.6913 1455.4015 1458.7182 1461.8206 1462.9435 1468.3183 1485.5822 1489.4583 1521.2870 1577.3007 1605.8063 2972.3231 2990.0902 2991.0781 3027.1553 3044.9637 3076.0957 3084.7513 3088.9861 3091.1362 3116.4726 3117.6981 3592.8219
redmass: 1.0810 3.4790 3.5345 6.4643 4.2551 3.8494 1.1931 2.2522 2.4671 3.0488 1.8437 4.3757 3.6612 4.2831 3.1575 4.1163 4.5186 3.9042 3.6133 1.3656 4.4409 3.3863 5.3708 3.4383 8.2610 4.0402 1.3898 3.5236 1.7022 2.6524 1.7034 1.4952 4.9454 1.4734 4.5244 2.1443 1.6688 2.3051 6.4069 1.1150 2.8640 1.4176 2.6426 1.2331 1.3232 1.3590 2.5273 1.1180 1.0459 1.1871 1.0454 1.2909 1.0536 1.0526 4.5933 5.1248 8.8780 1.0392 1.0361 1.0362 1.0590 1.0980 1.0974 1.0978 1.1002 1.1031 1.1053 1.0958 1.0812
irintensity: 0.1603 1.3021 1.4840 1.1294 1.2734 0.4946 1.6482 2.3348 0.9599 1.6565 0.7742 2.2195 2.1960 1.2747 6.9751 17.0461 4.5255 2.0892 0.1040 71.9224 0.5387 17.9460 17.6134 10.8933 7.2016 13.2595 1.3909 1.0696 5.1578 13.7019 9.9041 21.8871 373.3812 7.4970 67.2950 14.9618 31.9843 39.6878 110.3489 5.3632 21.1706 5.3319 64.1264 30.8427 8.5107 40.0783 156.6998 50.0576 14.7623 7.3822 14.9659 2.0905 15.3326 16.2423 28.0742 82.1199 275.9205 48.0264 22.2800 25.1091 38.1618 20.4088 14.9442 40.7536 20.5333 3.5105 32.1489 0.8132 70.5279
temp: 298.150 k
press: 1.00000 atm
elementType: 53 8 8 7 6 6 6 6 6 6 6 6 6 1 1 1 1 1 1 1 1 1 1 1 1
symmnumber: 1
zpe: 511367.1 jmol-1
zpe.correction: 0.194769 hartree
zpe.thermalcorrener: 0.209775 hartree
zpe.thermalcorrenthalpy: 0.210719 hartree
zpe.thermalcorrgfe: 0.148997 hartree
zpe.sumelectzpe: -565.889719 hartree
zpe.sumelectthermal: -565.874713 hartree
zpe.sumelectthermalent: -565.873769 hartree
zpe.sumelectthermalfe: -565.935492 hartree
dipole: 0.8827 0.5293 0.2971
dipole: 1.0712
quadrupole: -87.5124 -81.9198 -93.6264
quadrupole: 11.6804 0.2196 1.4290
quadrupole: 0.1738 5.7664 -5.9402 11.6804 0.2196 1.4290
hfenergy: -566.0844886 hartree
pointgroup: C01 [X(C9H12I1N1O2)]
dipole: 0.3833876 -0.0900365 -0.1500556 debye
dipolederiv: -0.2701345 -0.1854264 0.0042734 -0.1461189 -0.1150846 -0.0104978 0.0149568 -0.0034929 0.0372168 -1.452939 0.3519758 0.0692203 0.7548256 -0.7909887 -0.1228384 0.2369654 -0.1368383 -0.3501887 -1.0082129 -0.2721298 0.0296659 -0.2093388 -0.9433805 -0.0409491 0.0495885 -0.0586238 -0.3320096 -1.0032218 -0.1018643 0.0701897 0.0016797 -0.3341217 -0.0302355 0.1027507 -0.0072512 -0.2164779 -1.1446262 -0.0118274 0.1063685 0.2034629 -0.188784 -0.0315627 0.1728884 -0.010789 -0.126467 0.7212878 -0.1351532 -0.1048551 -0.3100796 0.17332 0.0595193 -0.1470161 0.0314906 0.0093128 0.1355426 -0.0847236 -0.0278483 -0.1827321 0.056467 0.0419073 -0.0532439 0.0235556 0.0013749 0.5593994 0.4096261 -0.0274603 0.4720917 0.3336253 0.0431875 -0.013554 0.0412701 -0.1825295 -0.1313526 0.0538734 0.0272534 -0.0360411 -0.1012207 -0.0320723 0.0060794 -0.0249415 0.1034955 0.0487399 0.0924798 0.0183537 0.0150321 -0.0431624 -0.0212367 0.006345 -0.0289798 0.054095 2.2586586 0.0146927 -0.1970682 -0.5222589 1.3444176 0.1617001 -0.3430623 0.1719267 0.2879406 1.0020508 -0.1782718 -0.0055361 -0.061543 0.2452985 -0.0132977 -0.0304814 0.0445057 0.3376127 -0.1335146 0.044445 -0.0580243 0.0017689 0.0444167 0.0033763 -0.0662315 -0.0317499 -0.1242393 0.2223762 -0.0060576 0.0128017 -0.0101142 0.209375 -0.0207606 0.013715 -0.0208836 0.3159427 0.0791955 0.0383294 0.0974632 0.0027189 -0.0048734 -0.0394111 0.0806791 -0.1180162 -0.0853906 0.059239 0.0822556 -0.0874135 0.0382461 -0.0692285 0.0418691 -0.0835996 0.1064521 -0.0048427 0.057783 -0.1145611 -0.02041 -0.0264657 0.1496273 0.0058925 -0.0038913 0.0160723 0.1269924 0.0621061 0.0321438 0.0987999 0.0305788 0.058407 0.0116726 0.1086879 -0.0310669 -0.0622454 -0.038234 -0.1580758 -0.0130075 -0.0722744 -0.0305364 -0.0174847 0.0048907 -0.0057233 0.1082731 0.0087815 0.0797425 -0.0927169 0.0739707 0.0416746 0.0081494 -0.1078421 0.0472471 0.0015938 -0.0269757 0.0212527 -0.00151 -0.1022226 -0.0210817 0.126663 -0.0058571 0.0610531 0.009906 -0.0260779 0.0349171 0.0030095 0.0792442 -0.0303108 -0.1343118 0.0258436 -0.0974534 -0.0232506 -0.2221854 0.0168536 0.0246675 0.0097533 0.1149612 0.0060293 0.0063891 0.0176045 0.08697 0.1081478 -0.0766282 0.0302528 -0.0347102 -0.0734554 0.1104558 -0.0048782 0.0804793 0.0149302 0.1341664 0.0521317 0.0435307 0.0305267 -0.0253612 -0.1057638 0.0298779 -0.0658472 0.0119848 unknown
polarizability: 194.3416183|19.009168|142.1585752|-8.451685|9.7694411|71.8567418 unknown
InChI: InChI=1S/C9H12INO2/c1-4-13-9(12)7-5(2)8(10)11-6(7)3/h11H,4H2,1-3H3
charge 0 multiplicity 1
25 atoms
I  4.056049 1.851851 0.019576
O  -1.903345 0.723932 0.609173
O  -1.818621 -1.57084 0.202764
N  2.393719 -0.722501 -0.224561
C  0.22815 -0.249787 0.153279
C  1.133055 -1.296284 -0.158308
C  0.980715 1.000005 0.27768
C  2.309668 0.654993 0.036271
C  0.929412 -2.76599 -0.392277
C  0.460652 2.374537 0.597567
C  -1.215975 -0.465231 0.309266
C  -3.383291 0.600214 0.767044
C  -4.088679 0.675798 -0.590665
H  3.254433 -1.225932 -0.434343
H  1.322513 -3.078772 -1.378567
H  1.435107 -3.374388 0.382313
H  -0.146773 -2.989585 -0.35456
H  -0.058379 2.387025 1.571683
H  1.286183 3.10705 0.627128
H  -0.278717 2.705124 -0.152588
H  -3.605825 -0.352655 1.278577
H  -3.645353 1.451832 1.415871
H  -5.184992 0.670667 -0.443456
H  -3.816732 1.602467 -1.125485
H  -3.820875 -0.19143 -1.216781
