program: Gaussian 09
title: 000224728
version: EM64L-G09RevD.01
frameworkgroup: C1[X(C19H29N3O)]
method: RPBEPBE
basis: SDD
operation: Freq
keyword: #p
keyword: freq=noraman
keyword: PBEPBE/SDD
title: #p freq=noraman PBEPBE/SDD
converged: YES YES NO NO
title: Mulliken charges:
elementType: O N N N C C C C C C C C C C C C C C C C C C C H H H H H H H H H H H H H H H H H H H H H H H H H H H H H
charge: -0.271277 -0.104882 -0.425372 -0.066079 -0.443634 -0.373753 -0.001825 -0.352692 -0.322131 -0.320980 -0.718381 0.181486 -0.673085 -0.677153 -0.377952 -0.071181 0.450863 -0.285398 -0.542621 -0.336607 0.313890 -0.347836 -0.537015 0.203665 0.181072 0.204532 0.219874 0.241267 0.197668 0.175622 0.183423 0.202620 0.204424 0.183274 0.208789 0.252456 0.195854 0.283099 0.207904 0.229068 0.204504 0.206482 0.230771 0.203776 0.217141 0.239677 0.252181 0.253161 0.240739 0.218704 0.242800 0.219064
chargesum: 0.00000
title: Mulliken charges with hydrogens summed into heavy atoms:
elementType: O N N N C C C C C C C C C C C C C C C C C C C
charge: -0.271277 -0.104882 -0.142273 -0.066079 -0.058897 0.050653 0.239442 0.020599 0.063912 0.066718 -0.061281 0.181486 -0.031609 -0.036124 -0.160811 -0.071181 0.450863 -0.045720 -0.290439 -0.083446 0.313890 -0.107097 0.143553
polarizability: 3.45384714e+02 -5.34883893e+01 1.93583541e+02 -2.98384328e+01 -9.69141905e+00 2.18856696e+02
1716.lowfreq: -11.8733 -8.2820 -4.2582 -0.0010 -0.0005 0.0005 5.2380 8.6349 21.2124
frequency: -3.2512 8.5333 21.0546 46.2911 54.5594 59.6411 75.3423 77.8074 85.4262 103.3333 113.2749 135.7053 170.9788 175.7483 187.4380 191.6510 199.7729 217.5226 228.4549 247.3637 252.0877 280.1348 295.3636 305.3313 341.2426 353.7439 373.8641 394.8039 407.8641 418.8580 431.0153 446.4007 469.0682 473.7028 495.2779 513.7107 521.8572 552.7470 581.1476 612.5847 668.6902 687.7558 734.0269 739.9347 744.3014 776.8728 792.8495 796.0183 808.4299 820.0227 822.6178 845.0689 870.6735 883.1088 915.0407 922.6426 936.1896 950.5914 965.3730 970.1664 979.4678 998.6969 1003.3471 1030.3208 1051.4353 1072.8617 1076.8161 1084.4145 1086.2048 1102.2270 1111.0092 1117.8848 1134.7265 1137.7222 1144.1767 1158.1808 1168.4270 1171.7085 1203.4273 1210.6771 1243.6492 1248.6714 1255.1216 1256.5259 1278.5012 1283.7167 1287.7045 1290.5564 1309.1186 1318.1265 1341.1703 1355.0687 1359.2233 1363.3956 1375.3515 1376.4062 1378.3188 1385.2143 1386.8576 1397.0695 1411.4187 1438.8944 1454.0132 1458.1165 1459.7802 1461.9130 1466.5668 1469.2979 1471.1849 1472.8450 1476.3569 1477.8317 1478.0669 1484.8382 1487.0699 1489.5086 1495.5635 1515.3094 1547.8771 1613.5768 1636.0837 2825.1694 2841.5589 2855.1902 2940.1273 2954.7081 2973.8813 2980.6603 2983.1411 2987.7037 3010.2393 3018.1734 3024.2083 3031.7711 3033.7130 3040.7628 3055.1201 3069.7511 3072.2627 3075.0455 3091.1022 3091.9601 3093.1789 3117.7163 3119.9646 3143.5586 3144.9039 3145.4909 3167.1035 3555.3602
redmass: 3.4326 4.2024 3.8870 4.3091 3.0334 2.8842 2.1155 3.1998 3.2428 2.6014 2.4127 2.3761 1.7243 3.5632 2.2406 2.0297 1.8244 1.2985 1.5534 1.8831 1.5981 2.1662 2.8188 2.5903 3.1724 3.3259 3.7971 1.3439 3.5074 3.2163 3.2280 3.0977 2.9942 3.0987 3.0869 3.2430 4.7548 4.6114 2.7224 6.0838 5.2349 3.6013 1.8860 2.9001 1.8261 2.5168 1.1350 1.1988 1.5550 2.2475 1.8885 2.2924 2.0300 1.6636 1.9275 4.4220 2.1046 1.3478 1.3551 3.1275 2.0078 1.7129 3.5802 3.4208 2.5673 1.9051 2.2964 2.1942 1.8950 2.6636 1.2581 1.7572 1.5407 1.7037 1.9723 1.2135 1.8208 1.6010 2.1929 1.8635 1.8843 1.6105 1.3356 2.0617 1.1238 1.3305 1.2487 1.2020 1.4180 3.3438 1.4234 1.4047 1.3339 1.3586 2.0553 1.6389 1.2801 1.2312 1.2292 3.4207 5.1781 1.2255 1.4383 1.0601 1.0813 1.0544 1.0506 1.1039 1.0918 1.0856 1.2134 1.0515 1.0746 1.0964 1.0787 1.0754 3.9208 3.4492 5.0282 6.9124 7.1883 1.0716 1.0723 1.0713 1.0658 1.0331 1.0364 1.0359 1.0358 1.0612 1.0885 1.0857 1.0887 1.0863 1.0877 1.1038 1.1021 1.0991 1.0984 1.0979 1.1002 1.0994 1.1002 1.0869 1.0989 1.0960 1.0886 1.0928 1.0966 1.0770
irintensity: 0.1097 0.0113 0.0009 2.1052 0.0859 2.0672 1.1442 1.5429 1.6333 1.4882 0.8308 2.2188 1.2801 7.1608 2.0764 3.8521 1.8870 0.3565 0.5066 1.7079 3.5583 1.4565 1.0714 3.3828 2.4285 0.9804 7.4719 89.7286 10.1710 23.1445 0.8604 29.8679 8.1044 6.6410 4.8757 1.8443 1.9872 13.1219 0.8764 7.6902 14.5870 3.2102 4.8133 6.4963 3.6128 0.1630 5.1261 6.6875 29.8115 2.5129 50.3548 1.2637 2.6425 45.9770 2.1765 2.7335 10.9685 0.8342 2.3714 0.7800 8.5653 11.3109 57.4262 4.0272 4.9701 19.7492 16.3155 6.8008 33.3349 19.4806 0.2710 83.3509 43.4618 0.2507 67.7968 16.4799 4.5860 64.7684 26.6734 12.4967 19.8640 14.9847 19.8800 167.7969 1.3476 25.1100 17.0822 19.9003 12.0722 7.7978 0.7718 15.5171 2.3388 11.0189 48.7878 6.4436 20.8918 22.7401 19.7609 108.1281 46.9115 2.8064 115.9120 3.2876 6.3828 6.6714 12.5908 3.4258 7.9381 12.9085 7.4856 3.8797 13.3377 12.3958 17.7428 13.4902 2.3552 482.9350 44.0470 338.1862 0.2240 55.5782 33.9613 242.7122 42.6942 92.6595 41.3805 33.3077 31.9529 19.1658 22.1424 14.2012 5.5641 9.2004 24.2661 52.8624 48.1049 56.3527 54.6164 79.9705 33.9136 33.7519 47.9174 7.9308 31.7204 16.3176 8.8202 18.6703 13.5696 49.2585
temp: 298.150 k
press: 1.00000 atm
elementType: 8 7 7 7 6 6 6 6 6 6 6 6 6 6 6 6 6 6 6 6 6 6 6 1 1 1 1 1 1 1 1 1 1 1 1 1 1 1 1 1 1 1 1 1 1 1 1 1 1 1 1 1
symmnumber: 1
zpe: 1171229.1 jmol-1
zpe.correction: 0.446098 hartree
zpe.thermalcorrener: 0.470362 hartree
zpe.thermalcorrenthalpy: 0.471306 hartree
zpe.thermalcorrgfe: 0.390041 hartree
zpe.sumelectzpe: -979.118084 hartree
zpe.sumelectthermal: -979.093820 hartree
zpe.sumelectthermalent: -979.092875 hartree
zpe.sumelectthermalfe: -979.174141 hartree
dipole: -1.3581 0.6084 0.7491
dipole: 1.6661
quadrupole: -122.9262 -142.5236 -127.9099
quadrupole: -6.3017 -14.6761 0.3999
quadrupole: 8.1937 -11.4037 3.2100 -6.3017 -14.6761 0.3999
hfenergy: -979.5641816 hartree
pointgroup: C01 [X(C19H29N3O1)]
dipole: 0.5285805 0.1342256 -0.3636609 debye
polarizability: 343.809188|41.7257658|202.1505909|-47.3677135|14.6290509|211.865172 unknown
InChI: InChI=1S/C19H29N3O/c1-5-22(6-2)13-7-8-15(3)20-19-12-9-16-14-17(23-4)10-11-18(16)21-19/h9-12,14-15,20H,5-8,13H2,1-4H3
charge 0 multiplicity 1
52 atoms
O  -6.429748 -1.271304 0.823715
N  5.360709 -0.781706 0.402483
N  0.624064 1.121069 -1.431012
N  -1.328004 0.974007 -0.120893
C  2.792964 1.970687 -0.609126
C  3.316396 0.64615 -0.010674
C  1.253608 2.118079 -0.540645
C  4.840691 0.479584 -0.187773
C  6.790837 -0.68209 0.801671
C  5.087868 -1.968241 -0.453655
C  0.785998 3.552431 -0.887295
C  -0.642459 0.593266 -1.223198
C  6.995005 0.105977 2.110077
C  5.024743 -3.28438 0.345673
C  -1.170842 -0.357256 -2.184596
C  -2.578918 0.412689 0.098941
C  -3.184236 -0.546565 -0.803968
C  -2.422637 -0.911836 -1.971169
C  -4.471672 -1.080376 -0.520031
C  -3.311926 0.797287 1.262282
C  -5.163917 -0.683029 0.633491
C  -4.578894 0.265049 1.531925
C  -7.183088 -0.888616 2.017793
H  3.245595 2.827289 -0.071268
H  3.121253 2.06784 -1.668451
H  2.779107 -0.202522 -0.47694
H  3.083935 0.602856 1.070325
H  0.9014 1.88016 0.480419
H  5.344315 1.326812 0.315066
H  5.102149 0.562143 -1.276385
H  7.412095 -0.230666 -0.014642
H  7.172171 -1.708788 0.950139
H  4.110047 -1.812774 -0.944892
H  5.843453 -2.059737 -1.276584
H  1.19479 4.281918 -0.16326
H  -0.315269 3.608031 -0.848686
H  1.120908 3.847163 -1.900226
H  1.09248 0.906298 -2.312052
H  6.649184 1.15198 2.021206
H  6.427448 -0.369476 2.928752
H  8.066295 0.13026 2.385383
H  5.980459 -3.505151 0.854847
H  4.237245 -3.219923 1.116253
H  4.798809 -4.134964 -0.324765
H  -0.574594 -0.629345 -3.063549
H  -2.840452 -1.632466 -2.683834
H  -4.937334 -1.806875 -1.194871
H  -2.849578 1.52269 1.93881
H  -5.112573 0.581511 2.433539
H  -7.4127 0.195246 2.024383
H  -8.119926 -1.462675 1.961224
H  -6.639449 -1.156809 2.945139
