program: Gaussian 09
title: 000224699
version: EM64L-G09RevD.01
frameworkgroup: C1[X(C5H11N7)]
method: RPBEPBE
basis: SDD
operation: Freq
keyword: #pfreq=noraman
keyword: PBEPBE/SDD
title: #p freq=noraman PBEPBE/SDD
converged: YES YES NO NO
title: Mulliken charges:
elementType: N N N N N N N C C C C C H H H H H H H H H H H
charge: -0.096963 -0.055418 -0.058204 0.009466 0.009258 -0.070888 -0.071720 -0.347770 -0.362354 -0.418629 -0.405092 -0.632060 0.221533 0.222825 0.221316 0.221359 0.237440 0.235258 0.236708 0.236821 0.224907 0.235051 0.207156
chargesum: 0.00000
title: Mulliken charges with hydrogens summed into heavy atoms:
elementType: N N N N N N N C C C C C
charge: -0.096963 -0.055418 -0.058204 0.009466 0.009258 -0.070888 -0.071720 0.096588 0.080322 0.054069 0.068437 0.035054
polarizability: 1.47608796e+02 -1.68650521e+01 1.11416257e+02 -4.19669149e+00 7.16678687e+00 6.83663131e+01
1716.lowfreq: -3.6949 0.0003 0.0003 0.0004 4.6650 9.0451 28.4005 33.7788 37.3013
frequency: 28.3935 33.7301 37.2351 56.9804 61.8321 89.6701 172.8528 184.6996 216.8242 219.8074 240.4992 315.8354 335.7422 367.7942 431.6785 475.7885 487.4759 491.2617 610.2565 620.9762 787.3398 800.0048 830.2368 854.8053 862.6897 1017.8538 1023.3048 1051.5720 1055.4559 1070.0650 1114.6457 1152.0876 1180.3693 1239.1070 1246.1636 1251.3845 1261.2936 1294.6547 1308.9439 1324.6506 1329.2434 1373.1554 1377.1035 1438.7475 1460.9186 1464.6338 1473.0400 1477.4411 1481.0864 1486.8440 2027.8915 2030.1384 2886.0673 2912.3569 2919.5597 3000.6703 3002.0568 3030.1594 3031.3749 3036.4214 3084.0298 3094.5790 3102.6421
redmass: 8.2399 7.2729 6.1914 5.1408 3.5349 2.5229 2.4329 1.6154 2.5679 3.2509 2.4333 6.2956 3.6703 3.3924 2.8536 4.2045 13.6711 8.1360 6.7271 5.9632 1.2740 1.2106 4.1303 6.2470 5.1804 3.1890 3.4968 1.9414 2.4433 1.7185 1.3892 1.5632 1.3310 2.1324 3.2103 2.8740 1.8898 1.2826 1.3369 1.3531 1.3918 1.3112 1.2934 1.1429 1.0755 1.0826 1.0469 1.0778 1.0803 1.0724 13.5459 13.5333 1.0544 1.0681 1.0680 1.0652 1.0647 1.0801 1.0883 1.0926 1.1008 1.1015 1.0998
irintensity: 1.0739 1.4650 0.2632 0.8283 0.3827 1.5501 0.1473 0.7947 2.4193 8.6282 6.7138 4.0386 1.0720 27.0457 1.7624 1.2883 5.5124 0.8069 10.0602 41.9786 8.7454 8.3043 3.6773 21.8639 8.1495 9.6236 3.1849 45.2888 49.9815 11.2391 8.8608 21.5720 3.7747 2.6901 41.2234 121.8240 36.1165 1.0063 8.9424 4.1058 4.1885 7.8892 1.2779 4.5022 4.3836 4.5256 13.3823 14.8217 8.2502 13.9569 549.0870 189.4464 104.8785 29.9030 96.4165 24.5640 62.2794 34.7442 16.2650 15.1400 28.1061 26.0977 19.6237
temp: 298.150 k
press: 1.00000 atm
elementType: 7 7 7 7 7 7 7 6 6 6 6 6 1 1 1 1 1 1 1 1 1 1 1
symmnumber: 1
zpe: 470886.8 jmol-1
zpe.correction: 0.179351 hartree
zpe.thermalcorrener: 0.193075 hartree
zpe.thermalcorrenthalpy: 0.194019 hartree
zpe.thermalcorrgfe: 0.135764 hartree
zpe.sumelectzpe: -579.298202 hartree
zpe.sumelectthermal: -579.284478 hartree
zpe.sumelectthermalent: -579.283534 hartree
zpe.sumelectthermalfe: -579.341789 hartree
dipole: 0.1619 3.2561 0.5446
dipole: 3.3053
quadrupole: -103.5271 -74.7031 -70.3522
quadrupole: 1.7039 1.0262 -2.3064
quadrupole: -20.6663 8.1577 12.5086 1.7039 1.0262 -2.3064
hfenergy: -579.4775529 hartree
pointgroup: C01 [X(C5H11N7)]
dipole: 0.1822217 1.255745 0.2845527 debye
dipolederiv: -0.912866 0.039278 0.0143981 -0.11647 -0.6276247 0.0949522 0.0217517 -0.0357841 -0.4869309 -0.2509454 0.0437689 -0.0880152 0.5582511 -1.22171 -0.3123889 0.0574097 -0.2498355 -0.3383347 -1.3040795 0.1186266 0.1497599 0.5411787 -0.3065464 0.0391142 0.3269627 0.0351684 -0.2447777 -0.1206886 -0.1205204 0.008189 -0.5816327 1.5786892 0.4161722 -0.0931004 0.4297245 0.1784383 1.5481685 -0.4267937 -0.2949137 -0.8240371 0.1007075 0.0604256 -0.4113068 -0.0024454 0.0931651 -0.1373964 0.1653604 0.0493163 0.3468006 -0.8239723 -0.1917205 0.1144087 -0.2450451 -0.1727671 -0.9509393 0.1369348 0.1264716 0.2983233 -0.1152781 -0.038309 0.1145035 -0.0049714 -0.1228658 0.5369805 -0.1430391 -0.1245172 -0.1980392 0.1850138 -0.0553442 -0.0240673 -0.1949578 0.2288773 0.4842895 0.1589198 0.0490152 0.3591239 0.1134143 0.0385237 -0.1027567 0.031336 0.3343547 0.4919568 -0.2236055 -0.0845922 -0.3235742 0.5224572 0.0974551 -0.2161496 0.1876305 0.3395952 0.8774265 0.1036636 0.009702 -0.0006965 0.2145395 -0.015852 0.1093365 0.0126964 0.2680734 -0.0048161 0.026889 0.0155527 0.055219 0.572543 -0.1128072 0.028488 -0.0610135 0.3144679 -0.0819866 -0.003895 0.0721013 -0.0486757 0.0153961 0.1355345 0.1109625 0.079042 -0.1187672 0.0311854 -0.0280705 -0.0389349 -0.0309107 -0.1076498 -0.0746897 -0.0464425 -0.0399432 0.0513887 -0.0106299 -0.0338872 0.0122867 -0.0851542 0.0196564 -0.0489736 -0.0895769 -0.0263782 -0.2072443 -0.07573 0.0973728 0.014581 0.0826615 -0.0371596 -0.0068161 0.0460898 -0.025878 0.0663835 0.0512377 -0.0371379 -0.0174815 -0.0297682 -0.0553445 -0.0903367 0.0040787 -0.0573658 0.0595899 -0.031517 0.0645921 0.1129571 -0.001648 -0.0214769 0.1082737 0.076364 0.0313493 -0.0665576 -0.0328858 0.0697862 -0.0065682 0.1030984 -0.0157262 -0.006354 0.0162554 -0.0327541 0.0802883 -0.0490734 -0.017503 0.0153151 -0.0784038 0.0630718 -0.0589199 -0.0524138 -0.0046532 -0.1292934 -0.1023226 -0.1227122 -0.1008351 -0.0767556 0.0586227 0.0026592 -0.0991803 -0.0105123 0.0445426 -0.0375095 0.137086 0.1105457 0.066774 0.0145663 -0.0328769 0.0972499 -0.0412759 0.0269678 0.082141 -0.0051139 -0.0043337 -0.0156644 -0.1261892 0.0522782 0.0111332 0.2258662 -0.1985939 unknown
polarizability: 143.9292888|-18.6998092|113.2333923|-8.8512911|11.3387812|70.2286853 unknown
InChI: InChI=1S/C5H11N7/c1-12(4-2-8-10-6)5-3-9-11-7/h2-5H2,1H3
charge 0 multiplicity 1
23 atoms
N  0.039545 1.348997 0.055454
N  3.579896 -0.104657 -0.012999
N  -2.927524 -1.062787 -0.062397
N  3.611629 -1.318999 -0.372905
N  -4.026913 -0.485769 0.188969
N  3.84788 -2.421136 -0.754018
N  -5.147702 -0.111646 0.328563
C  1.211648 0.656117 -0.521078
C  -1.271349 0.831036 -0.389808
C  2.308235 0.453175 0.556138
C  -1.65164 -0.435734 0.418164
C  0.157715 2.821585 0.033209
H  1.647491 1.21562 -1.38091
H  0.899813 -0.332647 -0.906855
H  -1.301452 0.594009 -1.478796
H  -2.034664 1.61053 -0.208035
H  2.600193 1.421041 0.99256
H  1.912754 -0.186576 1.36883
H  -0.891402 -1.222446 0.287144
H  -1.703999 -0.178891 1.493877
H  1.109745 3.131913 0.499028
H  -0.660085 3.2727 0.621584
H  0.128286 3.250764 -0.997618
