program: Gaussian 09
title: 000224737
version: EM64L-G09RevD.01
frameworkgroup: C1[X(C21H33N3)]
method: RPBEPBE
basis: SDD
operation: Freq
keyword: #pfreq=noraman
keyword: PBEPBE/SDD
title: #p freq=noraman PBEPBE/SDD
converged: YES YES NO NO
title: Mulliken charges:
elementType: N N N C C C C C C C C C C C C C C C C C C C C C H H H H H H H H H H H H H H H H H H H H H H H H H H H H H H H H H
charge: -0.116179 -0.427346 -0.030664 -0.065595 -0.409075 -0.396291 -0.371140 -0.709491 0.220286 -0.313923 -0.319449 0.314800 0.290626 -0.071869 -0.587050 0.322851 -0.674560 -0.672452 0.375366 -0.554447 -0.553600 -0.868762 -0.827824 -0.816462 0.223968 0.214971 0.197257 0.223786 0.195199 0.197430 0.195462 0.294657 0.199942 0.237027 0.216621 0.202244 0.187057 0.215013 0.187338 0.241799 0.221541 0.207984 0.208695 0.209726 0.209090 0.212327 0.262176 0.238414 0.239848 0.232979 0.228092 0.228766 0.224026 0.225957 0.223271 0.237316 0.222269
chargesum: 0.00000
title: Mulliken charges with hydrogens summed into heavy atoms:
elementType: N N N C C C C C C C C C C C C C C C C C C C C C
charge: -0.116179 -0.132688 -0.030664 0.158373 0.003152 0.022693 0.021752 -0.055901 0.220286 0.075378 0.082902 0.314800 0.290626 -0.071869 -0.345251 0.322851 -0.036340 -0.041308 0.375366 -0.292271 -0.315186 -0.167843 -0.149075 -0.133607
polarizability: 3.21068709e+02 2.30224951e+01 2.88114439e+02 2.17030000e+01 -4.22050549e+00 1.83159718e+02
1716.lowfreq: -13.6499 -7.9396 -3.4097 0.0005 0.0006 0.0008 8.1452 13.1055 23.6527
frequency: -10.8262 12.8824 23.4694 37.9071 46.3576 68.4862 73.6321 79.6266 85.8042 107.3618 127.0351 134.2108 139.8299 166.2189 186.8454 190.9008 194.2130 201.8454 202.8601 229.4296 235.5034 244.7369 285.3415 291.0480 292.2771 311.0719 317.0112 326.3557 343.6609 349.3779 367.2175 395.1120 419.9416 436.7621 443.9705 456.9643 461.9542 479.3098 523.1338 545.5115 556.9212 575.7259 611.8157 643.9299 654.6101 695.0209 695.3050 718.1270 749.6790 768.1024 786.1332 793.3928 795.4684 800.3186 846.3794 884.2793 890.2252 902.5122 913.4800 920.3369 924.9838 940.9123 954.2762 987.1441 992.2949 1004.6160 1016.6752 1027.7650 1034.0120 1040.7426 1048.5738 1053.1365 1071.8001 1080.1818 1081.7788 1085.0806 1093.9437 1111.8477 1118.4444 1136.5151 1158.0505 1170.6632 1184.6263 1198.0304 1214.4405 1251.0976 1256.4064 1259.3268 1274.5268 1283.1536 1286.6953 1291.5579 1295.1560 1315.8093 1324.9196 1343.0231 1349.4089 1352.9503 1360.1509 1365.7785 1375.3779 1381.7623 1382.9057 1384.6481 1387.9962 1393.6029 1398.9709 1403.8960 1437.8614 1439.7238 1449.7964 1457.9853 1460.2782 1461.0322 1462.1876 1466.1436 1470.2075 1471.9145 1472.3476 1473.4648 1474.5478 1475.2766 1476.6833 1477.7681 1479.8275 1487.3902 1489.7056 1492.4285 1505.1764 1552.4520 1575.2436 1636.8323 2851.2422 2856.6553 2869.5668 2948.1875 2961.3819 2966.7479 2968.3046 2969.3617 2976.9405 2978.7209 2981.9318 3013.2258 3016.9133 3024.2734 3032.0407 3036.4815 3038.3616 3040.0771 3040.2611 3046.6758 3070.8844 3074.7491 3076.3783 3077.1351 3078.8670 3079.8327 3080.0127 3086.9271 3088.0639 3095.3763 3144.5477 3147.5452 3478.5013
redmass: 3.6502 4.1665 3.6049 3.3752 3.8190 2.6787 2.6921 2.0247 2.9666 2.7845 1.1652 1.9314 2.7649 1.5089 1.3276 2.0329 1.1133 1.3301 1.9169 1.1027 2.8035 3.2567 1.9508 2.4824 2.1708 2.1733 3.5797 2.7403 3.7285 3.2410 3.3013 3.1004 3.1317 3.2580 2.9364 2.5645 2.4787 3.6001 3.2222 3.5114 3.5664 3.5485 3.6040 4.6464 1.8373 2.1882 3.4370 5.2923 5.0059 1.8791 1.5999 1.2109 2.4330 1.7917 1.8659 1.5387 1.8719 1.4290 1.9561 1.4257 1.7105 2.0899 2.2820 1.6114 1.6927 1.4789 1.9651 2.2161 1.4781 1.5095 2.0931 1.6461 1.9142 2.0319 2.6052 2.2871 2.7186 2.0121 2.2243 2.0394 2.0445 2.3490 2.8414 2.2387 1.6908 1.4514 4.2075 1.3477 1.2934 1.1505 1.2435 1.7873 1.2766 1.4565 2.6766 1.4816 3.2682 1.5498 1.3300 1.3111 1.3560 1.2423 1.2528 1.2364 2.7253 1.3574 1.3240 1.2372 2.6183 1.7059 1.4745 1.0752 1.0596 1.0517 1.1269 1.0639 1.0621 1.0973 1.2211 1.1168 1.1240 1.1049 1.5193 1.0855 1.0873 1.0768 1.1047 1.2164 2.1784 5.4592 4.0200 6.8727 1.0722 1.0718 1.0708 1.0401 1.0607 1.0377 1.0380 1.0369 1.0612 1.0353 1.0356 1.0932 1.0963 1.0911 1.0870 1.0887 1.0968 1.0967 1.0889 1.0981 1.0974 1.0985 1.0982 1.0955 1.0984 1.0998 1.0997 1.0978 1.1003 1.0906 1.0905 1.0910 1.0736
irintensity: 0.1057 0.0810 0.0863 0.3085 0.4011 0.1583 1.9069 0.6607 2.4655 0.1607 0.1115 0.3676 0.6541 1.2201 1.0908 0.9825 0.5127 0.2113 2.0802 0.1509 1.6734 0.6620 2.4157 0.4074 1.7274 1.3686 0.1734 0.0567 1.9344 0.4718 0.3793 4.5229 9.3646 3.4578 2.6823 12.5574 1.4409 1.4945 6.1687 3.0400 5.9866 2.6381 9.2556 0.7838 94.2665 9.8570 32.6881 2.9753 4.2731 3.6041 1.6402 4.9719 0.3068 10.5895 2.2986 17.2093 2.9342 0.8835 0.2697 20.2666 1.4861 14.3977 13.0522 10.9908 8.0652 15.5686 3.3521 10.7712 9.6308 6.8991 11.3593 0.0388 18.6488 18.5682 11.3542 18.2595 2.6777 2.8222 34.7477 66.9403 21.8652 6.6316 22.2263 24.1717 8.0399 20.9832 0.9822 1.2210 4.5689 4.1258 10.0925 4.9100 59.8865 10.6492 8.9919 2.0576 25.2556 4.8082 11.2968 1.8757 2.8364 14.6721 14.5559 26.5625 55.6528 3.8037 7.7204 12.3676 147.8028 3.1254 30.9364 4.8139 2.2029 0.9367 18.4303 1.1852 2.9653 5.4776 9.2227 8.4799 11.7347 29.6639 4.6813 13.1554 3.3048 18.9633 9.3956 7.7009 82.0313 122.8178 35.4826 10.1352 38.2052 40.6539 267.2760 49.9252 8.8733 36.9850 60.1435 26.9636 45.3113 26.4882 28.0753 9.3363 26.4896 4.8410 8.0173 15.6452 34.2083 10.0136 16.4145 49.3221 59.5845 30.2241 77.4816 15.2929 27.5274 42.1497 80.5445 14.2797 42.8910 44.2092 20.9532 3.4738 12.2419
temp: 298.150 k
press: 1.00000 atm
elementType: 7 7 7 6 6 6 6 6 6 6 6 6 6 6 6 6 6 6 6 6 6 6 6 6 1 1 1 1 1 1 1 1 1 1 1 1 1 1 1 1 1 1 1 1 1 1 1 1 1 1 1 1 1 1 1 1 1
symmnumber: 1
zpe: 1305897.7 jmol-1
zpe.correction: 0.497390 hartree
zpe.thermalcorrener: 0.523475 hartree
zpe.thermalcorrenthalpy: 0.524419 hartree
zpe.thermalcorrgfe: 0.440563 hartree
zpe.sumelectzpe: -982.439275 hartree
zpe.sumelectthermal: -982.413190 hartree
zpe.sumelectthermalent: -982.412246 hartree
zpe.sumelectthermalfe: -982.496102 hartree
dipole: 4.2358 -2.6574 0.7154
dipole: 5.0513
quadrupole: -148.2443 -142.0595 -148.3085
quadrupole: 13.9765 -1.5849 0.7874
quadrupole: -2.0402 4.1446 -2.1044 13.9765 -1.5849 0.7874
hfenergy: -982.9366648 hartree
pointgroup: C01 [X(C21H33N3)]
dipole: -1.7395828 0.9068404 0.31777 debye
polarizability: 316.9046813|25.8139097|291.7036303|-22.6469953|4.6799773|183.7345544 unknown
InChI: InChI=1S/C21H33N3/c1-7-24(8-2)11-9-10-18(6)23-21-17(5)14-22-20-13-16(4)15(3)12-19(20)21/h12-14,18,23H,7-11H2,1-6H3
charge 0 multiplicity 1
57 atoms
N  -4.427155 0.328107 -0.603454
N  -0.510228 -0.63972 0.542924
N  3.420683 -2.100098 -0.416929
C  -0.819818 0.227828 1.72171
C  -2.272857 0.737214 1.574538
C  -2.497797 1.648663 0.347996
C  -3.974196 1.660019 -0.113942
C  -0.615468 -0.53902 3.052113
C  0.778894 -1.088804 0.196816
C  -5.896677 0.131607 -0.4640
C  -3.942571 0.035299 -1.981301
C  1.887027 -0.172975 -0.003614
C  1.009319 -2.472587 -0.029201
C  3.194007 -0.736556 -0.265678
C  1.759156 1.253277 -0.029087
C  2.856794 2.103594 -0.212909
C  -6.333448 -0.161758 0.984291
C  -3.83255 -1.473446 -2.273593
C  4.176045 1.534878 -0.381262
C  4.310925 0.144075 -0.418691
C  2.337798 -2.898499 -0.332806
C  -0.101277 -3.497502 0.09578
C  2.663221 3.608804 -0.254608
C  5.387065 2.434156 -0.550186
H  -0.126195 1.085733 1.714367
H  -2.948042 -0.139151 1.4782
H  -2.559692 1.26303 2.506431
H  -1.851776 1.293488 -0.47796
H  -2.186163 2.68889 0.573868
H  -4.118767 2.450288 -0.893077
H  -4.611798 1.944378 0.744271
H  -1.242739 -1.34604 0.410321
H  -1.331814 -1.3791 3.137091
H  0.409154 -0.947324 3.115432
H  -0.77301 0.131176 3.91773
H  -6.182502 -0.729317 -1.095605
H  -6.463403 1.013337 -0.859122
H  -2.939286 0.48497 -2.091043
H  -4.593038 0.52327 -2.751176
H  0.7613 1.697521 0.040834
H  -5.816902 -1.061934 1.361347
H  -6.099273 0.675784 1.666428
H  -7.425081 -0.334128 1.030873
H  -3.143006 -1.950307 -1.553663
H  -4.809136 -1.985118 -2.196121
H  -3.445522 -1.642121 -3.295816
H  5.285701 -0.325002 -0.589902
H  2.522119 -3.971792 -0.47984
H  0.292363 -4.51531 -0.06773
H  -0.571261 -3.479714 1.099631
H  -0.907964 -3.341004 -0.650265
H  1.601348 3.879729 -0.125094
H  3.241262 4.116456 0.541996
H  3.006981 4.038542 -1.215565
H  5.533262 3.089226 0.330629
H  6.306039 1.839738 -0.685286
H  5.282349 3.101349 -1.427689
