program: Gaussian 09
title: 000224701
version: EM64L-G09RevD.01
frameworkgroup: C1[X(C20H23NO2)]
method: RPBEPBE
basis: SDD
operation: Freq
keyword: #p
keyword: freq=noraman
keyword: PBEPBE/SDD
title: #p freq=noraman PBEPBE/SDD
converged: YES YES NO NO
title: Mulliken charges:
elementType: O O N C C C C C C C C C C C C C C C C C C C C H H H H H H H H H H H H H H H H H H H H H H H
charge: -0.481414 -0.325423 -0.129554 -0.206449 -0.049899 -0.443000 -0.419592 0.252205 -0.359726 -0.398714 0.444284 0.374918 -0.646444 -0.413385 -0.409278 -0.387869 -0.381556 -0.257979 -0.224843 -0.224796 -0.249907 -0.246507 -0.244862 0.205032 0.225799 0.256194 0.215560 0.197910 0.202946 0.213142 0.216259 0.221920 0.375843 0.224957 0.229885 0.289040 0.215967 0.295272 0.273838 0.233938 0.219901 0.223257 0.222059 0.221342 0.225025 0.224705
chargesum: 0.00000
title: Mulliken charges with hydrogens summed into heavy atoms:
elementType: O O N C C C C C C C C C C C C C C C C C C C C
charge: -0.105571 -0.325423 -0.129554 -0.001417 -0.049899 0.038993 -0.006123 0.252205 0.056362 0.039466 0.444284 0.374918 0.097438 -0.197418 -0.114005 -0.114031 -0.147618 -0.038078 -0.001586 -0.002738 -0.028565 -0.021482 -0.020157
polarizability: 2.28351915e+02 -1.30474522e+01 2.33413043e+02 1.54232916e+01 -5.16949446e+00 1.92403973e+02
1716.lowfreq: -6.0016 -4.4731 -0.0005 0.0006 0.0006 11.9140 36.1019 43.2301 47.7251
frequency: 36.0954 43.1798 47.6613 55.9429 60.7247 78.2607 107.5988 122.6597 158.0473 162.0145 202.7318 221.4469 227.0986 250.9163 253.8267 271.7034 294.4272 316.7938 349.3244 366.0147 392.1496 401.7037 403.4528 404.1458 421.9995 459.1475 488.9517 501.2670 540.4297 586.8959 616.5530 617.3005 632.0773 648.0815 693.2360 701.5143 706.5848 717.1580 756.7869 760.6930 777.8869 804.5419 813.9283 838.1250 848.6574 857.5574 860.3392 893.0325 909.6678 925.3935 934.2027 959.0501 968.3858 973.0355 980.5149 989.5033 990.4773 995.0415 999.6977 1004.1982 1027.4183 1029.8442 1034.1489 1049.1816 1078.8271 1084.8635 1095.7141 1101.0370 1120.6569 1126.8079 1147.5847 1167.7445 1170.1166 1172.4535 1182.7875 1190.6227 1192.7502 1202.8815 1220.9780 1249.6944 1263.4619 1288.2058 1296.1891 1311.9739 1317.9565 1329.6836 1339.0968 1350.0888 1359.9782 1373.9663 1379.6625 1390.4517 1406.6348 1424.1038 1432.3474 1435.9496 1451.5268 1462.0213 1470.1887 1476.4297 1478.2347 1479.6298 1486.3103 1490.1758 1573.4042 1589.3593 1591.0744 1608.2786 1612.0222 2961.6002 2972.8858 2976.1510 2983.7294 2997.1605 3006.2526 3027.4960 3039.5042 3053.0496 3061.0416 3062.9529 3113.8970 3116.0858 3121.8685 3125.0058 3125.4389 3137.0643 3138.2698 3152.8861 3156.0980 3165.4782 3175.8330 3235.7379
redmass: 3.8236 4.0047 3.7734 4.5633 4.5591 4.7007 3.0578 4.2982 1.2715 2.2946 3.7563 3.9524 4.7538 4.2217 3.2495 3.3402 4.0269 3.1583 4.5708 4.5441 4.0530 3.0096 3.3459 3.0699 2.4326 4.4099 1.9186 3.1983 4.0432 4.1127 6.3911 6.4145 5.3430 4.7141 4.4546 1.7514 1.9196 2.5689 1.8564 1.2821 2.0129 2.3795 2.8715 1.9051 1.2690 1.2566 2.3733 2.4725 2.0732 1.7095 1.8099 2.5430 2.6596 1.4112 1.4154 6.1425 5.4533 1.3274 1.9685 1.4648 2.1949 2.1779 2.0811 2.8611 1.5986 2.1304 2.1429 1.9435 1.3499 2.0186 1.3810 1.3894 1.0940 1.5176 1.4738 1.2011 1.7585 1.7145 1.7714 1.7208 1.2805 1.2291 1.5049 1.3546 1.3410 1.3441 1.3388 1.4353 1.4232 3.1449 6.3863 2.1132 1.5486 1.6134 2.1806 2.2274 1.0880 1.0867 1.0905 1.0882 2.1429 2.1600 1.2902 1.0474 4.6240 6.0720 6.2460 6.0913 6.0876 1.0635 1.0371 1.0615 1.0655 1.0666 1.0786 1.0946 1.1004 1.1013 1.0983 1.1016 1.0847 1.0848 1.0977 1.0872 1.0878 1.0930 1.0938 1.0960 1.0989 1.0989 1.0951 1.0650
irintensity: 0.4437 0.0206 0.2458 0.5159 1.4516 2.0634 0.8259 0.0967 0.1125 0.5099 1.0994 1.3652 1.7078 0.5534 0.8971 3.9717 1.8200 1.6149 3.3827 5.0219 25.7138 1.7544 5.2381 2.2465 7.9793 2.6783 1.1740 3.5557 6.8207 20.4441 0.0180 0.1399 15.0817 6.3427 5.5611 39.4338 57.5827 38.5192 25.6714 135.3485 90.5036 24.2293 26.0117 2.4714 1.4010 0.0417 23.2840 8.9513 6.1490 5.2634 1.3338 11.8292 23.2790 1.5203 0.6364 0.6180 0.6008 0.0685 4.6672 0.6617 5.7432 10.6572 9.3225 11.6890 9.0068 16.9340 26.2267 12.8505 2.4789 11.9842 55.7161 10.9905 1.4535 11.2997 13.0194 7.6850 10.0616 24.1241 13.3022 10.4969 15.5906 10.9135 26.8210 2.2491 4.5124 10.9249 7.4855 1.9020 1.3371 57.5377 5.1148 126.1973 5.8596 84.0422 4.2011 38.4924 7.4648 10.2345 5.0483 7.0599 27.8565 9.7345 26.6416 10.9926 186.6952 2.3300 0.4714 10.4472 3.6538 23.6447 58.1055 42.7126 23.1709 0.7984 16.5085 53.0397 51.4213 29.5141 36.3057 24.4471 10.7842 3.7466 1.1656 3.7425 4.7652 37.6010 38.1828 25.6007 31.5900 17.7145 11.1623 290.8707
temp: 298.150 k
press: 1.00000 atm
elementType: 8 8 7 6 6 6 6 6 6 6 6 6 6 6 6 6 6 6 6 6 6 6 6 1 1 1 1 1 1 1 1 1 1 1 1 1 1 1 1 1 1 1 1 1 1 1
symmnumber: 1
zpe: 1007374.3 jmol-1
zpe.correction: 0.383689 hartree
zpe.thermalcorrener: 0.404228 hartree
zpe.thermalcorrenthalpy: 0.405173 hartree
zpe.thermalcorrgfe: 0.334361 hartree
zpe.sumelectzpe: -979.454676 hartree
zpe.sumelectthermal: -979.434136 hartree
zpe.sumelectthermalent: -979.433192 hartree
zpe.sumelectthermalfe: -979.504004 hartree
dipole: -3.7555 -1.8554 -3.7095
dipole: 5.5953
quadrupole: -120.3607 -131.3715 -134.9523
quadrupole: 2.4613 6.0834 -2.4946
quadrupole: 8.5341 -2.4767 -6.0575 2.4613 6.0834 -2.4946
hfenergy: -979.8383646 hartree
pointgroup: C01 [X(C20H23N1O2)]
dipole: 1.4117337 -0.9812914 1.3747649 debye
polarizability: 231.9053345|12.3514132|229.866336|16.0112703|5.5700531|192.3972606 unknown
InChI: InChI=1S/C20H23NO2/c1-21-15-9-8-14-18(19(21)22)20(23,16-10-4-2-5-11-16)17-12-6-3-7-13-17/h2-7,10-13,18,23H,8-9,14-15H2,1H3
charge 0 multiplicity 1
46 atoms
O  -0.458031 0.173093 -2.078295
O  2.057216 0.910753 -1.602797
N  3.284639 -0.173681 0.042188
C  0.849664 -0.686618 -0.163777
C  -0.456657 0.070609 -0.613933
C  0.944619 -2.144928 -0.711609
C  1.753535 -3.079113 0.219379
C  2.099811 0.090971 -0.614929
C  3.229825 -2.677387 0.459707
C  3.424184 -1.25689 1.049199
C  -0.558662 1.489026 0.008856
C  -1.70448 -0.744795 -0.215049
C  4.523097 0.495489 -0.403311
C  0.05298 1.856452 1.233109
C  -2.522027 -1.334326 -1.208734
C  -1.354002 2.451463 -0.664373
C  -2.045098 -0.922007 1.150105
C  -0.1169 3.155132 1.766852
C  -3.659291 -2.091228 -0.843649
C  -1.529398 3.745726 -0.132508
C  -3.17475 -1.686054 1.515558
C  -0.91017 4.105619 1.088091
C  -3.988075 -2.275227 0.518762
H  0.830397 -0.755939 0.940507
H  1.377178 -2.134529 -1.72996
H  -0.078405 -2.547835 -0.812356
H  1.731732 -4.105472 -0.196279
H  1.235511 -3.129378 1.200377
H  3.68174 -3.405352 1.16276
H  3.804783 -2.746126 -0.48521
H  2.720156 -1.095007 1.889382
H  4.442245 -1.16537 1.466502
H  0.418602 0.630179 -2.284841
H  5.244816 -0.239868 -0.807969
H  4.994507 1.031713 0.440704
H  4.260544 1.214173 -1.193859
H  0.679089 1.145119 1.784268
H  -2.252974 -1.180706 -2.257151
H  -1.818565 2.167734 -1.613936
H  -1.446761 -0.439923 1.932608
H  0.371699 3.422136 2.711244
H  -4.287023 -2.537686 -1.623665
H  -2.147096 4.475286 -0.668963
H  -3.428182 -1.810681 2.574732
H  -1.042858 5.111995 1.501279
H  -4.869166 -2.862643 0.801588
