program: Gaussian 09
title: 000224679
version: EM64L-G09RevD.01
frameworkgroup: C1[X(C13H12N2O2S)]
method: RPBEPBE
basis: SDD
operation: Freq
keyword: #p
keyword: freq=noraman
keyword: PBEPBE/SDD
title: #p freq=noraman PBEPBE/SDD
converged: YES YES NO NO
title: Mulliken charges:
elementType: S O O N N C C C C C C C C C C C C C H H H H H H H H H H H H
charge: 0.180376 -0.254647 -0.261380 -0.450441 -0.572765 0.425315 0.386400 0.504965 -0.673928 -0.424660 -0.379453 -0.421812 -0.413178 -0.243453 -0.247120 0.256163 -0.821860 0.024477 0.244699 0.236450 0.307900 0.236650 0.240339 0.369298 0.225494 0.226443 0.302812 0.301782 0.345723 0.349413
chargesum: 0.00000
title: Mulliken charges with hydrogens summed into heavy atoms:
elementType: S O O N N C C C C C C C C C C C C C
charge: 0.180376 -0.254647 -0.261380 -0.081143 0.122370 0.425315 0.386400 0.504965 -0.429229 -0.188210 -0.071553 -0.185162 -0.172839 -0.017959 -0.020677 0.256163 -0.217266 0.024477
polarizability: 2.87592714e+02 2.96494186e+01 2.00652430e+02 -7.06754181e-01 9.89061987e+00 9.30718462e+01
1716.lowfreq: -3.3853 -0.0019 -0.0014 0.0013 3.4025 7.8916 30.1406 34.6061 57.8267
frequency: 29.9920 34.5993 57.8235 70.8894 81.9466 135.9469 144.7351 185.4147 190.6183 203.4852 262.7400 311.9341 327.8528 380.6939 405.6556 414.8090 443.0076 465.1915 476.1218 477.9836 513.8335 536.8170 550.1012 561.7584 614.2317 618.9802 644.4580 650.1598 661.7235 734.4861 756.5875 758.4562 774.2796 783.2201 836.9704 849.8018 864.5879 886.2355 901.1979 916.3783 935.9584 960.1530 975.4769 986.3945 1000.2266 1022.2201 1061.7106 1123.8565 1145.8551 1159.8063 1171.6113 1201.3531 1236.6108 1245.1634 1248.3812 1277.1351 1278.3397 1310.7651 1351.5784 1405.5422 1414.9403 1421.8762 1438.7995 1465.9611 1510.3133 1555.6528 1588.6292 1593.6152 1608.9852 1624.4692 1640.6931 1655.8045 3045.2090 3115.1530 3117.7073 3122.9546 3129.5594 3140.4708 3144.2645 3160.2330 3191.2246 3304.2569 3521.4563 3673.0958
redmass: 4.5592 5.9155 7.5621 8.0168 7.1679 7.3756 5.7958 4.0109 6.4169 4.8569 7.6688 3.4338 4.5093 4.2338 3.4202 3.8152 7.0131 2.6468 2.0753 1.7900 6.7088 3.8278 1.2697 6.2266 3.8561 6.1512 4.1811 5.7864 2.8222 5.8800 1.3381 4.6700 4.9935 2.4788 1.2781 3.0427 1.4256 1.5042 2.5007 1.6057 4.8756 1.4012 4.0162 1.3327 1.3423 2.2398 2.0332 1.7163 1.2958 1.2208 1.0760 1.4506 2.4073 1.4929 1.3709 2.0618 2.5020 2.5490 1.9199 4.1076 1.1134 3.7239 4.4954 2.3470 3.4414 2.7680 3.4105 2.0644 5.0762 2.4800 6.0430 3.3366 1.0605 1.0913 1.0859 1.0890 1.0905 1.0948 1.1046 1.1003 1.0949 1.0817 1.0449 1.1051
irintensity: 1.3232 2.0868 3.0654 2.1641 7.0621 8.9457 10.8736 2.2802 5.4515 4.9594 3.6101 3.4112 3.1519 4.4098 1.0270 2.3779 0.6521 18.8043 15.6194 9.4996 0.8035 2.7022 265.3451 3.3829 37.4475 12.7727 53.2395 34.6497 1.5592 3.1378 64.5919 0.1640 3.1104 1.5403 26.6447 1.7568 8.7783 97.7161 2.9596 78.1158 4.8886 17.1567 2.0411 0.0751 0.5851 6.9913 6.7960 13.3612 26.2270 4.4843 2.1904 3.7606 6.5515 31.4857 9.5927 26.2285 188.6515 72.8529 51.2672 14.3848 37.8851 24.9351 21.6627 7.9759 250.6722 178.5804 134.6204 0.4246 156.0993 332.2434 109.7458 167.5072 5.9144 8.6758 8.8716 0.4348 11.4424 36.6266 0.0291 41.6891 8.7932 329.4981 84.7689 44.6917
temp: 298.150 k
press: 1.00000 atm
elementType: 16 8 8 7 7 6 6 6 6 6 6 6 6 6 6 6 6 6 1 1 1 1 1 1 1 1 1 1 1 1
symmnumber: 1
zpe: 596931.6 jmol-1
zpe.correction: 0.227359 hartree
zpe.thermalcorrener: 0.243355 hartree
zpe.thermalcorrenthalpy: 0.244299 hartree
zpe.thermalcorrgfe: 0.182318 hartree
zpe.sumelectzpe: -1159.374614 hartree
zpe.sumelectthermal: -1159.358618 hartree
zpe.sumelectthermalent: -1159.357674 hartree
zpe.sumelectthermalfe: -1159.419655 hartree
dipole: -3.0333 4.9371 -0.6635
dipole: 5.8323
quadrupole: -85.7089 -104.9046 -114.6487
quadrupole: -15.8837 1.9907 -4.7151
quadrupole: 16.0452 -3.1506 -12.8946 -15.8837 1.9907 -4.7151
hfenergy: -1159.6019731 hartree
pointgroup: C01 [X(C13H12N2O2S1)]
dipole: 1.3058929 1.812311 0.5248212 debye
polarizability: 283.5923118|-34.5870391|205.4538508|-2.2660282|4.2174181|92.270828 unknown
InChI: InChI=1S/C13H12N2O2S/c14-13(17)18-8-12(16)15-11-6-5-9-3-1-2-4-10(9)7-11/h1-7,15H,8,14H2
charge 0 multiplicity 1
30 atoms
S  4.485626 -0.531844 0.668767
O  1.802286 -2.917801 -0.310993
O  3.091867 1.580217 -0.458637
N  1.260987 -0.624812 -0.52868
N  4.643002 2.121863 1.190169
C  -2.189512 0.754816 -0.086534
C  -2.955027 -0.44519 0.189125
C  -0.139009 -0.602274 -0.285589
C  -0.784569 0.645227 -0.319617
C  -2.266725 -1.702313 0.215392
C  -0.895416 -1.795979 -0.01405
C  -2.870914 2.018592 -0.115636
C  -4.364582 -0.336097 0.424099
C  -4.245888 2.093722 0.117354
C  -5.001095 0.907339 0.389998
C  2.125944 -1.708364 -0.516169
C  3.58323 -1.322704 -0.807574
C  3.97153 1.238632 0.384036
H  -0.206347 1.554931 -0.527568
H  -2.840644 -2.613567 0.422514
H  -0.375801 -2.755414 0.007471
H  -2.294583 2.927965 -0.325145
H  -4.938624 -1.247219 0.631952
H  1.71771 0.292881 -0.677105
H  -4.755476 3.063461 0.092115
H  -6.079085 0.981439 0.57074
H  4.154581 -2.237756 -1.017968
H  3.671157 -0.608572 -1.643391
H  5.379388 1.821049 1.82693
H  4.393487 3.10967 1.141294
