program: Gaussian 09
title: 000224677
version: EM64L-G09RevD.01
frameworkgroup: C1[X(C12H14N2O4S)]
method: RPBEPBE
basis: SDD
operation: Freq
keyword: #p
keyword: freq=noraman
keyword: PBEPBE/SDD
title: #p freq=noraman PBEPBE/SDD
converged: YES YES NO NO
title: Mulliken charges:
elementType: S O O O O N N C C C C C C C C C C C C H H H H H H H H H H H H H H
charge: 0.184534 -0.292601 -0.261488 -0.245665 -0.262277 -0.443522 -0.571484 0.490144 0.237095 -0.444288 -0.347983 -0.318734 -0.354846 0.177430 0.259405 -0.821624 -0.219225 -0.676100 0.025286 0.240414 0.308700 0.268319 0.268891 0.369509 0.303165 0.304823 0.228410 0.227828 0.211153 0.228120 0.228880 0.350729 0.347005
chargesum: 0.00000
title: Mulliken charges with hydrogens summed into heavy atoms:
elementType: S O O O O N N C C C C C C C C C C C C
charge: 0.184534 -0.292601 -0.261488 -0.245665 -0.262277 -0.074013 0.126250 0.490144 0.237095 -0.203874 -0.039284 -0.050416 -0.085955 0.177430 0.259405 -0.213637 0.237013 -0.007948 0.025286
polarizability: 2.90694700e+02 9.74807683e+00 1.86663473e+02 2.69436727e+00 7.52252620e+00 1.01939732e+02
1716.lowfreq: -11.5702 -0.0021 -0.0017 0.0005 2.9986 3.5452 17.7355 29.2512 42.6770
frequency: 13.4500 29.2026 42.6107 52.6540 62.0993 70.8151 85.7429 97.1252 109.7589 140.8522 153.6867 184.1276 203.3598 242.3268 247.3255 278.9633 330.7181 338.1089 353.7218 374.5494 411.8228 415.4883 443.0801 472.7791 479.6571 514.4096 537.4952 554.4653 601.9731 616.7577 629.6176 646.1706 681.8302 689.7820 739.6347 762.3419 786.4114 797.6102 822.8724 838.2533 848.6107 885.5781 900.0905 902.2359 937.3225 980.6932 1004.7809 1011.7435 1024.2693 1061.3243 1062.4961 1112.3625 1124.0253 1136.2051 1144.6508 1184.1074 1234.6065 1247.9828 1248.4214 1249.5925 1277.5688 1287.4464 1309.7551 1358.2902 1377.2651 1398.6333 1414.4624 1425.8542 1462.8002 1473.5191 1486.6421 1502.8749 1538.0261 1584.5727 1593.7295 1618.2695 1623.0170 1627.6960 1657.1669 2994.0740 3007.8437 3045.7923 3065.1486 3090.9058 3105.0179 3128.1799 3145.1412 3156.1232 3176.9621 3196.4563 3289.6173 3520.8055 3671.9860
redmass: 3.2446 5.5405 4.1017 5.2959 5.1414 5.3240 6.1906 5.6590 3.8434 5.3760 5.7317 6.1162 4.2950 5.4597 1.3216 4.0470 5.9549 5.7368 3.8608 4.8155 3.2459 3.0562 7.5156 1.6466 2.6785 3.8176 4.4013 1.2748 5.4311 4.2688 6.9795 3.8224 4.2342 6.5212 6.2239 4.3728 5.5325 1.1054 3.1218 1.4433 4.1704 1.4097 1.2669 2.2232 5.6926 1.3636 3.4075 1.3343 2.2793 3.7923 2.3208 2.2097 1.3628 1.4707 1.2946 1.1576 2.3641 1.4696 1.1538 2.2817 2.9008 2.1746 1.4880 1.4235 5.3739 1.2723 1.1212 4.1205 1.0408 1.0589 1.0748 2.5847 2.8567 4.4206 1.7869 10.3137 4.0660 2.8688 3.1847 1.0357 1.0581 1.0606 1.1064 1.0985 1.1025 1.0904 1.1045 1.0909 1.0947 1.0951 1.0822 1.0450 1.1051
irintensity: 0.1822 1.3540 1.7301 0.8548 0.6838 5.4313 2.1577 4.1772 10.1492 4.1437 5.8380 4.2071 5.1753 12.6508 0.8695 7.8593 2.5600 4.3126 6.9261 10.9467 10.3096 1.4623 1.3323 4.6664 1.9283 11.3690 4.3495 259.1696 5.3158 51.5693 2.5542 79.4879 30.5703 13.3961 4.5481 6.2006 9.7105 2.2109 4.9108 2.1927 7.8392 15.6101 173.4250 4.8792 4.6873 1.5773 28.4903 0.6631 26.5343 299.9405 130.5151 3.0787 21.3871 5.4907 32.3737 138.8248 55.2355 57.2410 10.4871 324.7881 195.9465 89.3891 39.4331 6.2710 169.8688 19.4598 39.3642 24.3990 11.8677 6.2758 16.7591 22.4485 391.9856 420.7357 20.7546 223.2784 64.2794 355.1730 163.1282 24.1445 24.9608 4.9797 8.5898 35.3394 47.1883 10.5235 0.0253 1.8746 2.1384 2.5961 394.5474 89.4758 46.2372
temp: 298.150 k
press: 1.00000 atm
elementType: 16 8 8 8 8 7 7 6 6 6 6 6 6 6 6 6 6 6 6 1 1 1 1 1 1 1 1 1 1 1 1 1 1
symmnumber: 1
zpe: 656548.8 jmol-1
zpe.correction: 0.250066 hartree
zpe.thermalcorrener: 0.269535 hartree
zpe.thermalcorrenthalpy: 0.270479 hartree
zpe.thermalcorrgfe: 0.198865 hartree
zpe.sumelectzpe: -1272.786897 hartree
zpe.sumelectthermal: -1272.767428 hartree
zpe.sumelectthermalent: -1272.766484 hartree
zpe.sumelectthermalfe: -1272.838098 hartree
dipole: -4.3422 6.9418 0.0080
dipole: 8.1880
quadrupole: -87.0966 -115.3549 -118.7457
quadrupole: -7.0761 6.7899 -8.3620
quadrupole: 19.9691 -8.2891 -11.6800 -7.0761 6.7899 -8.3620
hfenergy: -1273.0369633 hartree
pointgroup: C01 [X(C12H14N2O4S1)]
dipole: 1.8743558 -2.5906719 -0.3907205 debye
polarizability: 288.9104595|16.641215|188.841925|-3.9066126|3.8544437|101.5455206 unknown
InChI: InChI=1S/C12H14N2O4S/c1-2-18-11(16)8-3-5-9(6-4-8)14-10(15)7-19-12(13)17/h3-6,14H,2,7,13H2,1H3
charge 0 multiplicity 1
33 atoms
S  5.01955 0.407561 -0.750785
O  -4.371107 -0.970987 -0.075046
O  -4.580797 1.327532 -0.411851
O  2.386248 2.822782 0.303082
O  3.634633 -1.677675 0.435407
N  1.837209 0.537196 0.548459
N  5.141087 -2.254543 -1.242526
C  0.433659 0.535784 0.359546
C  -2.378627 0.361414 0.008067
C  -0.226803 -0.724811 0.432489
C  -0.324297 1.71472 0.108904
C  -1.616697 -0.810843 0.25924
C  -1.71582 1.614118 -0.064029
C  -3.8519 0.327956 -0.182244
C  2.712952 1.615037 0.501041
C  4.175248 1.219738 0.74715
C  -5.848003 -1.090035 -0.250186
C  -6.194277 -2.566331 -0.084394
C  4.4974 -1.355606 -0.432425
H  0.359597 -1.631156 0.626034
H  0.185122 2.678005 0.054648
H  -2.125632 -1.776657 0.315921
H  -2.315501 2.509612 -0.258085
H  2.290788 -0.385105 0.68354
H  4.2837 0.512941 1.586686
H  4.760944 2.13148 0.930537
H  -6.341847 -0.451437 0.504727
H  -6.113129 -0.701763 -1.250473
H  -7.283476 -2.710726 -0.205574
H  -5.676325 -3.18052 -0.840984
H  -5.905454 -2.928948 0.917126
H  4.883576 -3.239366 -1.175888
H  5.866777 -1.969369 -1.898613
