program: Gaussian 09
title: 000224670
version: EM64L-G09RevD.01
frameworkgroup: C1[X(C10H12N2O3S)]
method: RPBEPBE
basis: SDD
operation: Freq
keyword: #p
keyword: freq=noraman
keyword: PBEPBE/SDD
title: #p freq=noraman PBEPBE/SDD
converged: NO YES NO NO
title: Mulliken charges:
elementType: S O O O N N C C C C C C C C C C H H H H H H H H H H H H
charge: 0.177683 -0.264982 -0.260601 -0.261720 -0.443005 -0.573451 0.484114 -0.461492 -0.330291 0.321831 -0.323771 -0.352003 0.250504 -0.817772 -0.538281 0.022737 0.234129 0.307996 0.365213 0.238794 0.248991 0.301272 0.299968 0.218910 0.218099 0.244082 0.345010 0.348038
chargesum: 0.00000
title: Mulliken charges with hydrogens summed into heavy atoms:
elementType: S O O O N N C C C C C C C C C C
charge: 0.177683 -0.264982 -0.260601 -0.261720 -0.077792 0.119597 0.484114 -0.227363 -0.022295 0.321831 -0.084977 -0.103013 0.250504 -0.216533 0.142810 0.022737
polarizability: 2.31120948e+02 1.34966210e+01 1.62513626e+02 -3.53483540e+00 -7.80008445e+00 8.74767538e+01
1716.lowfreq: -10.1807 -6.6667 -2.8280 -0.0019 -0.0018 0.0005 32.9249 35.9951 59.1230
frequency: 32.8952 35.9656 59.1194 67.5340 79.3533 110.2905 143.0017 146.3846 192.5534 205.3489 222.8167 248.3014 316.0615 348.0671 370.2808 397.0863 416.5711 439.7107 443.6190 472.7880 493.2536 527.3198 546.1825 560.5763 613.8032 624.8958 643.4356 651.7063 724.7926 731.0404 749.9581 798.7441 821.7278 849.9051 861.8693 898.8639 929.4813 938.3143 985.1498 988.8013 1001.6927 1061.0411 1112.7435 1117.5701 1142.5916 1156.5754 1181.1963 1219.7322 1233.2674 1244.3820 1276.3909 1284.9358 1306.4961 1374.9372 1413.4277 1425.9253 1436.2904 1465.9152 1473.3526 1503.3353 1541.4501 1590.6613 1595.9217 1620.1343 1629.2638 1652.1994 2953.8200 3039.3465 3044.1612 3121.7264 3123.3725 3143.8454 3160.4359 3163.1623 3193.7862 3317.0142 3521.9811 3673.9179
redmass: 4.5944 4.7700 6.6185 5.6426 6.6413 4.7291 5.4723 6.4758 5.3550 2.6057 3.8291 1.4652 3.4709 5.5648 4.7685 5.4343 3.0581 3.4719 7.4844 1.3178 3.9026 2.5557 1.2677 5.6539 3.7280 7.1521 4.1254 5.3680 3.9430 5.2195 5.8542 1.3525 3.2373 1.4470 1.2884 2.2585 1.4004 5.7805 1.3131 8.2938 2.6639 2.0330 1.2601 1.3218 1.2819 1.3314 1.2400 2.3825 2.7317 1.2591 3.1104 2.3181 1.4350 6.3318 1.1175 3.8324 1.1727 1.0505 1.0750 2.4900 2.4098 1.9520 4.2160 2.3591 6.3610 3.2953 1.0332 1.1037 1.0606 1.0959 1.0924 1.1045 1.0907 1.0936 1.0955 1.0816 1.0449 1.1051
irintensity: 2.5687 1.9129 1.6058 0.9536 7.4001 13.9868 5.3242 3.0387 7.7338 3.7401 8.0601 0.3896 7.4992 0.4341 5.2445 1.9429 0.0222 7.2578 4.0927 3.5971 18.8681 29.4359 264.3336 15.7538 52.8244 1.5419 64.1072 7.8605 1.3386 8.9597 11.0307 4.9143 21.8782 31.6370 155.4202 2.6461 11.8254 2.4531 2.1261 44.7904 17.6380 7.0261 0.2665 23.3368 31.7688 1.5719 60.7561 153.5394 69.8349 23.3674 224.7000 10.6294 3.8486 58.9632 29.5130 1.7839 14.5377 13.0139 88.8075 205.1468 293.6688 76.8622 138.9185 299.9922 6.6755 242.6555 80.7316 53.5493 6.6911 41.5229 0.2437 0.0308 7.1868 11.4463 5.6500 290.0147 82.7695 44.4430
temp: 298.150 k
press: 1.00000 atm
elementType: 16 8 8 8 7 7 6 6 6 6 6 6 6 6 6 6 1 1 1 1 1 1 1 1 1 1 1 1
symmnumber: 1
zpe: 557493.1 jmol-1
zpe.correction: 0.212338 hartree
zpe.thermalcorrener: 0.228449 hartree
zpe.thermalcorrenthalpy: 0.229393 hartree
zpe.thermalcorrgfe: 0.167170 hartree
zpe.sumelectzpe: -1120.338690 hartree
zpe.sumelectthermal: -1120.322578 hartree
zpe.sumelectthermalent: -1120.321634 hartree
zpe.sumelectthermalfe: -1120.383857 hartree
dipole: 2.7566 -6.4091 -0.0164
dipole: 6.9768
quadrupole: -73.3694 -95.5046 -103.1100
quadrupole: -3.3203 -5.3799 5.8349
quadrupole: 17.2919 -4.8432 -12.4487 -3.3203 -5.3799 5.8349
hfenergy: -1120.5510274 hartree
pointgroup: C01 [X(C10H12N2O3S1)]
dipole: -1.2474197 2.4251967 -0.3109123 debye
polarizability: 228.7082135|18.3369034|165.534494|5.6104724|0.1274235|86.8686209 unknown
InChI: InChI=1S/C10H12N2O3S/c1-15-8-4-2-7(3-5-8)12-9(13)6-16-10(11)14/h2-5,12H,6,11H2,1H3
charge 0 multiplicity 1
28 atoms
S  -3.949599 -0.676595 -0.738108
O  4.793432 0.350892 -0.347535
O  -1.016062 -2.802668 0.119717
O  -2.817073 1.500432 0.547937
N  -0.743037 -0.487709 0.506741
N  -4.412632 1.969767 -1.080736
C  0.651014 -0.304933 0.285697
C  1.167869 1.008884 0.417108
C  1.535615 -1.368066 -0.053898
C  3.412154 0.212369 -0.122619
C  2.538491 1.27516 0.216247
C  2.900783 -1.102168 -0.254413
C  -1.479626 -1.654991 0.405667
C  -2.974023 -1.459887 0.696522
C  5.363389 1.691824 -0.216964
C  -3.646907 1.116878 -0.326656
H  0.492781 1.833182 0.678714
H  1.140198 -2.380318 -0.154702
H  -1.296757 0.363332 0.707525
H  2.904573 2.300168 0.325872
H  3.593533 -1.90802 -0.515795
H  -3.437971 -2.446831 0.833532
H  -3.153547 -0.820179 1.576716
H  5.230543 2.090015 0.808473
H  4.91561 2.394893 -0.947043
H  6.435727 1.571077 -0.43034
H  -5.104356 1.628835 -1.746629
H  -4.281223 2.974156 -0.961827
