program: Gaussian 09
title: 000224700
version: EM64L-G09RevD.01
frameworkgroup: C1[X(C19H21NS)]
method: RPBEPBE
basis: SDD
operation: Freq
keyword: #p
keyword: freq=noraman
keyword: PBEPBE/SDD
title: #p freq=noraman PBEPBE/SDD
converged: YES YES NO NO
title: Mulliken charges:
elementType: S N C C C C C C C C C C C C C C C C C C C H H H H H H H H H H H H H H H H H H H H H
charge: 0.156793 -0.024562 -0.064141 -0.430021 -0.442176 -0.358859 -0.285011 -0.570458 -0.676543 0.508776 -0.418943 -0.413684 0.275243 -0.229507 -0.229552 -0.244752 -0.385939 -0.333463 -0.202375 -0.219680 -0.250763 0.237348 0.212509 0.216553 0.239942 0.217411 0.231672 0.212777 0.204067 0.233972 0.260734 0.264589 0.230597 0.233626 0.222047 0.222529 0.226137 0.249230 0.244335 0.226693 0.225190 0.227660
chargesum: 0.00000
title: Mulliken charges with hydrogens summed into heavy atoms:
elementType: S N C C C C C C C C C C C C C C C C C C C
charge: 0.156793 -0.024562 0.173207 -0.000958 0.015176 0.085591 -0.285011 -0.132419 -0.151220 0.508776 -0.188346 -0.180058 0.275243 -0.007461 -0.007023 -0.018615 -0.136709 -0.089128 0.024318 0.005510 -0.023103
polarizability: 2.72852179e+02 4.13290958e+01 2.20871803e+02 5.55607023e+00 -1.07922776e+01 2.02630676e+02
1716.lowfreq: -10.8618 -7.1692 0.0013 0.0019 0.0019 3.3245 7.1665 19.9328 27.0233
frequency: 5.4173 19.6457 26.8800 36.9391 49.6927 60.4425 83.5793 103.8493 109.7899 167.3748 193.6327 230.6591 243.6871 278.8319 295.2464 315.6025 336.6463 385.4553 403.6177 408.8719 418.8623 444.0806 504.8793 511.0914 534.5602 570.3860 589.9952 598.3697 609.9110 616.9167 619.0356 644.8424 695.2564 705.9240 759.2832 764.4031 776.0725 786.7163 808.6781 832.5079 837.9310 847.2860 854.5170 904.6448 911.3520 919.3451 935.2635 967.3027 973.5279 976.0657 985.3452 987.9585 989.7252 991.8573 993.9341 1021.9179 1026.2581 1042.5537 1048.6012 1065.0136 1079.2600 1090.6389 1116.3697 1150.1076 1158.1519 1169.0419 1171.3209 1179.4392 1186.6665 1191.2907 1209.2697 1218.0526 1251.7439 1255.5866 1277.8227 1290.4092 1309.2516 1312.0764 1323.7039 1328.6372 1334.6519 1346.7263 1357.2147 1374.3406 1382.3763 1436.6410 1440.8975 1447.0557 1455.6932 1459.3794 1467.5587 1471.8026 1478.1529 1483.4399 1578.0123 1592.9090 1600.6907 1614.1347 1636.7710 2970.4698 2972.1679 2982.3991 2990.4222 3002.3503 3021.5834 3028.8073 3033.3625 3048.9419 3057.9754 3097.7299 3112.8303 3114.1519 3124.8149 3129.9996 3132.8415 3141.6636 3146.5644 3156.2759 3160.6713 3168.4935
redmass: 3.8338 5.1227 4.6552 3.9056 4.0233 4.3479 4.9297 3.7482 4.1401 2.6481 3.1507 5.2665 5.1412 3.4814 2.8988 3.1767 2.5060 4.7060 2.8245 2.9207 2.6882 4.0326 3.5032 4.0351 3.9783 5.7043 3.3058 4.1065 5.5221 5.2360 4.9031 5.7862 1.8554 1.7469 1.8894 1.6980 1.4015 5.0589 3.8184 1.4079 1.2683 2.7883 1.2485 1.6455 1.4883 1.9142 2.2453 1.3745 2.0244 1.4062 5.0301 1.3496 5.6791 1.7891 1.6134 2.1360 2.2429 3.3684 1.7833 1.5323 1.5544 1.5675 1.7618 1.5187 1.3887 1.0678 1.0523 1.1714 1.1172 1.4108 2.3265 2.4978 1.2624 1.2857 1.2399 1.2834 1.3579 1.3282 1.4546 1.2470 1.4249 1.4028 1.4832 6.3710 7.6600 2.3674 2.1787 1.0903 1.0840 1.0898 1.1217 2.0811 1.1416 2.2046 6.0709 6.0440 6.3612 6.1650 10.8655 1.0616 1.0603 1.0639 1.0610 1.0836 1.0657 1.0943 1.0978 1.0975 1.1032 1.1074 1.0866 1.0870 1.0845 1.0908 1.0880 1.0958 1.0931 1.0962 1.1015 1.1011
irintensity: 0.0130 0.0159 0.0262 0.1342 0.1678 2.4119 1.2387 1.4590 2.0242 0.3746 0.7293 1.1966 3.6466 0.3073 0.2486 1.6957 0.1466 4.2935 0.0074 1.5685 2.2524 1.1365 18.9373 2.2322 19.3989 0.8012 10.1266 4.4145 5.0004 9.6311 11.4779 3.2221 43.2280 52.7380 39.0316 32.5356 32.7355 13.8979 11.9223 6.4143 0.6204 21.0055 0.1716 7.2719 11.1132 26.5460 25.3977 0.0111 10.6032 0.7820 0.3478 0.7492 0.7643 7.2201 3.6306 7.6222 6.1224 12.1849 2.7855 0.2643 13.8974 13.9321 1.7894 4.3817 1.4032 0.1873 0.1364 1.4530 0.1872 12.4498 12.6276 0.2133 15.0976 11.8473 2.0011 10.3313 1.8097 2.5707 2.8697 0.6663 1.8901 2.3098 5.1869 0.5044 0.2659 3.3200 7.2376 8.7339 12.1449 1.7463 15.0531 34.2605 5.3541 19.3147 10.1400 1.4090 95.2126 12.5178 217.4138 21.1650 13.7058 54.9495 30.3662 18.8016 23.9078 19.2421 20.9587 54.4346 35.7490 17.8434 9.2886 8.2292 4.4392 11.8864 6.4480 46.3044 28.2816 25.1144 27.1107 19.8750
temp: 298.150 k
press: 1.00000 atm
elementType: 16 7 6 6 6 6 6 6 6 6 6 6 6 6 6 6 6 6 6 6 6 1 1 1 1 1 1 1 1 1 1 1 1 1 1 1 1 1 1 1 1 1
symmnumber: 1
zpe: 913048.8 jmol-1
zpe.correction: 0.347762 hartree
zpe.thermalcorrener: 0.367134 hartree
zpe.thermalcorrenthalpy: 0.368079 hartree
zpe.thermalcorrgfe: 0.295026 hartree
zpe.sumelectzpe: -1187.911092 hartree
zpe.sumelectthermal: -1187.891720 hartree
zpe.sumelectthermalent: -1187.890776 hartree
zpe.sumelectthermalfe: -1187.963828 hartree
dipole: 0.6047 2.4764 -0.0101
dipole: 2.5491
quadrupole: -127.6467 -123.5504 -126.0534
quadrupole: 3.5233 0.3578 -5.2291
quadrupole: -1.8965 2.1997 -0.3032 3.5233 0.3578 -5.2291
hfenergy: -1188.2588542 hartree
pointgroup: C01 [X(C19H21N1S1)]
dipole: -0.2041072 -0.9678046 0.1659146 debye
polarizability: 270.2456931|41.2920729|227.2659785|-11.4888298|7.3341845|198.8429851 unknown
InChI: InChI=1S/C19H21NS/c1-3-8-16(9-4-1)13-14-17-10-7-15-21-19(17)20-18-11-5-2-6-12-18/h1-6,8-9,11-12,17H,7,10,13-15H2
charge 0 multiplicity 1
42 atoms
S  1.60613 -1.327394 1.756194
N  1.828886 -0.201395 -0.820731
C  0.100761 -1.919531 -0.659651
C  0.222204 -3.435101 -0.338437
C  -1.286588 -1.346796 -0.232362
C  0.172263 -3.769662 1.168939
C  1.23673 -1.082435 -0.076995
C  -1.600657 0.043073 -0.850748
C  1.385858 -3.216602 1.923978
C  -2.983092 0.53893 -0.452335
C  -4.119044 0.249463 -1.252377
C  -3.175198 1.265576 0.751711
C  2.813646 0.749397 -0.457348
C  -5.410589 0.670524 -0.862025
C  -4.463995 1.689464 1.147084
C  -5.587958 1.391903 0.341376
C  3.872651 0.97099 -1.380774
C  2.749124 1.537816 0.726346
C  4.870525 1.92659 -1.104728
C  3.740826 2.508939 0.983678
C  4.810178 2.702165 0.078706
H  0.189109 -1.795738 -1.756896
H  1.170195 -3.822923 -0.763557
H  -0.600889 -3.960116 -0.860777
H  -1.349502 -1.275469 0.869891
H  -2.067891 -2.065754 -0.552675
H  -0.761914 -3.386941 1.619499
H  0.161038 -4.871017 1.298557
H  -1.524043 -0.033464 -1.952923
H  -0.826436 0.764905 -0.530874
H  1.303604 -3.373755 3.012566
H  2.323334 -3.674057 1.564567
H  -3.987229 -0.302936 -2.191616
H  -2.306415 1.505322 1.377952
H  -6.275095 0.442377 -1.496267
H  -4.591932 2.254634 2.077563
H  -6.587723 1.723013 0.644411
H  3.89255 0.380095 -2.302114
H  1.916109 1.406455 1.425566
H  5.689348 2.076485 -1.817338
H  3.677858 3.114655 1.894781
H  5.579558 3.453812 0.286383
