program: Gaussian 09
title: 000224675
version: EM64L-G09RevD.01
frameworkgroup: C1[X(C11H14N2O2S)]
method: RPBEPBE
basis: SDD
operation: Freq
keyword: #p
keyword: freq=noraman
keyword: PBEPBE/SDD
title: #p freq=noraman PBEPBE/SDD
converged: YES YES NO NO
title: Mulliken charges:
elementType: S O O N N C C C C C C C C C C C H H H H H H H H H H H H H H
charge: 0.179450 -0.245558 -0.259186 -0.465046 -0.576188 0.165425 0.363585 0.349938 -0.416290 -0.427484 -0.233287 -0.827051 -0.833754 0.255749 -0.814704 0.022758 0.231071 0.230534 0.357514 0.223469 0.217601 0.287162 0.217136 0.238901 0.240871 0.226912 0.298801 0.299994 0.343912 0.347763
chargesum: 0.00000
title: Mulliken charges with hydrogens summed into heavy atoms:
elementType: S O O N N C C C C C C C C C C C
charge: 0.179450 -0.245558 -0.259186 -0.107532 0.115487 0.165425 0.363585 0.349938 -0.185219 -0.196951 -0.009817 -0.105152 -0.127069 0.255749 -0.215909 0.022758
polarizability: 2.01350422e+02 -6.93399265e+00 1.71039618e+02 7.17950435e+00 -9.05557130e-01 9.75018142e+01
1716.lowfreq: -8.7527 -3.9299 -0.0024 -0.0017 -0.0013 5.7014 32.5497 41.5467 62.6426
frequency: 32.5122 41.5417 62.6166 75.5551 106.0331 110.2214 153.8525 175.7286 178.0643 179.2350 203.3141 230.8455 278.6860 304.9658 331.1976 344.0116 389.6996 442.3592 470.9124 472.1877 484.6107 513.7964 518.4272 540.0568 545.6854 566.9958 612.7925 628.5988 641.8734 702.5710 742.3901 748.8527 776.9912 793.6897 828.7608 897.2935 897.9618 912.9203 947.1195 973.9280 989.4298 1040.5441 1049.4655 1053.5412 1060.3143 1096.2055 1140.1592 1176.6314 1214.1399 1243.5614 1257.2085 1261.7897 1274.5719 1284.1546 1370.1380 1396.9372 1404.0618 1412.3797 1440.4575 1452.6964 1456.4635 1470.5925 1483.8149 1486.7060 1515.9665 1593.2818 1603.2075 1606.3639 1625.8683 1652.1076 2968.8503 2976.4578 3043.9273 3045.6558 3057.6701 3084.3924 3086.1079 3119.5617 3129.4329 3142.9559 3155.3773 3338.1434 3521.2581 3673.0119
redmass: 4.5389 5.1682 6.0042 6.4406 4.4008 6.6523 4.4289 1.3398 2.9193 1.7379 2.0204 2.4163 3.2131 3.5431 3.0278 3.7017 3.6003 8.2879 1.6921 2.4084 3.0651 4.4199 3.0889 5.5871 1.2596 4.4707 3.6146 5.7504 3.9466 4.1620 6.0504 4.7057 1.2280 1.1735 3.8111 1.4331 1.9785 3.3389 3.1701 1.3518 1.6340 1.7195 1.5500 1.6474 2.0304 1.7059 1.3209 1.1628 3.0162 1.2934 1.9137 2.1145 3.0304 2.5007 6.6357 1.2440 1.2570 1.1096 2.2116 1.6380 1.1997 1.0765 1.2717 1.2665 1.7918 1.6454 6.2036 4.8654 3.5995 3.8228 1.0381 1.0363 1.0966 1.0599 1.0970 1.0984 1.0996 1.0855 1.0919 1.1054 1.0995 1.0805 1.0449 1.1051
irintensity: 1.3666 4.0165 1.8448 3.5341 5.1743 8.4900 5.3949 1.3543 4.5017 6.0114 5.5857 1.2269 2.9834 5.4307 0.6415 6.8881 3.2387 0.7364 4.1816 4.5034 10.2002 0.5461 0.1879 3.8431 266.1564 0.5890 47.7635 11.0715 72.8913 0.6994 7.9691 2.5899 51.7664 127.0930 0.8714 2.0387 8.3132 1.0038 8.3528 0.2134 5.5728 5.0743 1.2705 11.9064 7.8811 10.4110 22.6795 1.8551 2.7932 32.7839 11.4700 17.5215 191.3905 45.7494 16.6753 25.6386 6.6486 28.0242 0.8170 25.2610 20.3369 15.8453 73.5229 56.1372 251.0249 23.6256 14.0324 26.2895 274.5129 274.0579 26.1406 26.2293 14.5922 6.0550 11.7061 24.5268 24.5506 0.2261 27.5346 0.0206 37.2580 232.7023 84.7141 44.0125
temp: 298.150 k
press: 1.00000 atm
elementType: 16 8 8 7 7 6 6 6 6 6 6 6 6 6 6 6 1 1 1 1 1 1 1 1 1 1 1 1 1 1
symmnumber: 1
zpe: 617957.4 jmol-1
zpe.correction: 0.235368 hartree
zpe.thermalcorrener: 0.251983 hartree
zpe.thermalcorrenthalpy: 0.252927 hartree
zpe.thermalcorrgfe: 0.190554 hartree
zpe.sumelectzpe: -1084.439766 hartree
zpe.sumelectthermal: -1084.423150 hartree
zpe.sumelectthermalent: -1084.422206 hartree
zpe.sumelectthermalfe: -1084.484580 hartree
dipole: -4.3795 3.4692 1.4053
dipole: 5.7611
quadrupole: -77.1301 -95.0725 -110.0232
quadrupole: -8.7971 2.1669 -8.2118
quadrupole: 16.9452 -0.9972 -15.9480 -8.7971 2.1669 -8.2118
hfenergy: -1084.6751333 hartree
pointgroup: C01 [X(C11H14N2O2S1)]
dipole: 1.6962623 -1.2332394 0.8598141 debye
polarizability: 197.3122879|-14.7640095|164.1087997|-14.7410318|-22.4025227|108.470767 unknown
InChI: InChI=1S/C11H14N2O2S/c1-7-4-3-5-8(2)10(7)13-9(14)6-16-11(12)15/h3-5,13H,6,12H2,1-2H3
charge 0 multiplicity 1
30 atoms
S  3.276568 0.098824 -1.262614
O  0.033772 1.715251 -1.895962
O  2.552315 -0.552663 1.329729
N  0.114512 0.533473 0.142497
N  4.201332 -1.872216 0.349537
C  -1.259655 0.116087 0.23728
C  -2.317857 1.071189 0.216793
C  -1.519379 -1.27767 0.408172
C  -3.647722 0.593765 0.338684
C  -2.859852 -1.707095 0.541747
C  -3.923671 -0.779523 0.498534
C  -2.05779 2.55847 0.100934
C  -0.382495 -2.284656 0.426373
C  0.667886 1.273129 -0.892403
C  2.170029 1.546038 -0.720601
C  3.298405 -0.837979 0.350087
H  -4.470133 1.318552 0.321007
H  -3.067384 -2.776249 0.667511
H  0.792482 0.127888 0.809264
H  -4.958934 -1.124869 0.595839
H  -1.222171 2.873334 0.753969
H  -1.768277 2.822586 -0.932638
H  -2.954695 3.136575 0.381463
H  0.254525 -2.184639 -0.472903
H  0.279799 -2.152001 1.304141
H  -0.775284 -3.314979 0.456947
H  2.458113 2.371915 -1.386534
H  2.442714 1.771005 0.323732
H  4.825827 -2.04531 -0.436794
H  4.255422 -2.469232 1.174707
