program: Gaussian 09
title: 000224674
version: EM64L-G09RevD.01
frameworkgroup: C1[X(C11H14N2O2S)]
method: RPBEPBE
basis: SDD
operation: Freq
keyword: #p
keyword: freq=noraman
keyword: PBEPBE/SDD
title: #p freq=noraman PBEPBE/SDD
converged: YES YES NO NO
title: Mulliken charges:
elementType: S O O N N C C C C C C C C C C C H H H H H H H H H H H H H H
charge: 0.177190 -0.257465 -0.260658 -0.449900 -0.573889 0.387248 0.331421 0.505243 -0.676840 -0.415040 -0.380983 -0.816208 -0.815446 0.252020 -0.819654 0.023145 0.238755 0.228274 0.304907 0.229208 0.225652 0.224707 0.223234 0.230904 0.222458 0.367613 0.301024 0.300278 0.344735 0.348069
chargesum: 0.00000
title: Mulliken charges with hydrogens summed into heavy atoms:
elementType: S O O N N C C C C C C C C C C C
charge: 0.177190 -0.257465 -0.260658 -0.082287 0.118916 0.387248 0.331421 0.505243 -0.438085 -0.186766 -0.076077 -0.136641 -0.138850 0.252020 -0.218352 0.023145
polarizability: 2.25640735e+02 1.05332285e+01 1.75364672e+02 1.69081916e+00 5.10611346e+00 9.41467762e+01
1716.lowfreq: -10.8857 -5.6869 -1.0254 0.0012 0.0013 0.0021 28.5532 37.4875 57.8198
frequency: 28.4170 37.4834 57.8063 75.0767 85.7316 115.7522 138.7659 147.1233 153.6730 186.2399 198.5180 236.1574 274.2645 295.6859 324.5272 350.9095 389.4227 439.5218 442.5512 448.4688 465.6218 477.4015 535.2373 545.8583 570.6227 592.5926 613.9081 643.2682 654.3376 725.2110 735.0035 739.3975 781.8190 844.9625 849.4459 874.1711 897.1859 910.8830 960.8339 977.7526 994.6912 1014.2397 1030.2135 1053.0419 1060.9101 1124.2943 1145.7113 1182.3800 1222.8947 1243.0695 1248.0056 1273.6304 1277.4670 1312.1366 1370.7970 1392.7545 1401.6385 1409.5240 1413.5952 1461.3468 1469.2930 1473.9554 1478.4303 1505.3497 1543.1902 1591.4686 1598.7461 1621.3857 1628.3797 1653.0901 2964.7587 2968.8941 3034.9463 3041.8201 3043.8850 3080.3810 3083.2214 3110.8283 3124.7578 3143.5495 3195.4515 3320.9294 3521.9419 3673.9071
redmass: 3.8493 5.3854 6.9187 6.9907 5.8458 1.1021 3.8639 4.7574 1.1389 4.1130 4.5707 3.3571 3.9965 3.0833 3.1655 4.1795 4.0850 3.1570 7.1896 2.9103 2.2562 1.6858 4.6228 1.2631 5.5321 3.5391 3.8108 4.0693 5.6315 2.7352 5.2602 4.6059 4.6996 1.2529 1.3124 2.3275 1.4311 3.2678 2.4274 1.3299 1.6141 1.7867 1.4426 1.6384 2.0330 1.9371 1.2677 1.6073 1.9200 1.5629 1.7776 2.0095 2.6391 2.1977 5.3423 1.2404 1.5715 1.7375 1.2356 1.0482 1.1278 1.0463 1.1997 2.6239 2.4354 1.7965 4.4680 2.4886 5.9235 3.3550 1.0379 1.0378 1.0970 1.0969 1.0606 1.0982 1.0978 1.0913 1.0906 1.1045 1.0944 1.0815 1.0449 1.1051
irintensity: 1.8457 2.1230 2.8568 4.7010 5.2683 0.2818 6.6693 8.9970 1.3942 3.9261 8.1676 4.7306 2.4031 1.1413 6.0459 0.6115 4.7750 1.9788 0.7485 3.6101 13.2118 2.3265 3.1615 266.5047 11.7392 3.4733 51.6166 60.1099 20.2571 2.0734 3.5127 1.1446 7.3255 66.3726 15.6515 0.6166 88.9558 2.0005 4.2952 9.3088 6.8022 7.8110 16.2291 0.1995 6.7624 8.4787 24.7003 7.2926 2.3824 38.0657 9.1871 46.2687 179.0030 16.6444 33.3884 5.3448 37.1144 4.5973 23.4835 0.3484 31.5017 29.7934 1.4321 101.3191 372.2075 54.8797 108.5061 282.8573 56.0286 222.6142 58.5411 33.6526 36.9565 11.0339 6.4397 36.6691 5.7722 17.5503 21.0842 0.0352 3.5892 278.1721 82.0097 44.0964
temp: 298.150 k
press: 1.00000 atm
elementType: 16 8 8 7 7 6 6 6 6 6 6 6 6 6 6 6 1 1 1 1 1 1 1 1 1 1 1 1 1 1
symmnumber: 1
zpe: 618029.8 jmol-1
zpe.correction: 0.235395 hartree
zpe.thermalcorrener: 0.252197 hartree
zpe.thermalcorrenthalpy: 0.253141 hartree
zpe.thermalcorrgfe: 0.189685 hartree
zpe.sumelectzpe: -1084.445703 hartree
zpe.sumelectthermal: -1084.428902 hartree
zpe.sumelectthermalent: -1084.427957 hartree
zpe.sumelectthermalfe: -1084.491413 hartree
dipole: -2.4299 5.2608 -0.6678
dipole: 5.8332
quadrupole: -75.4960 -100.0078 -103.1257
quadrupole: -10.4684 3.2459 -5.9864
quadrupole: 17.3805 -7.1313 -10.2492 -10.4684 3.2459 -5.9864
hfenergy: -1084.6810986 hartree
pointgroup: C01 [X(C11H14N2O2S1)]
dipole: 1.0436375 -1.9581509 -0.5858844 debye
polarizability: 224.4242858|13.2077244|176.2298056|-2.6052595|6.8676323|94.4980918 unknown
InChI: InChI=1S/C11H14N2O2S/c1-7-3-4-9(5-8(7)2)13-10(14)6-16-11(12)15/h3-5,13H,6,12H2,1-2H3
charge 0 multiplicity 1
30 atoms
S  3.825237 0.71081 -0.622753
O  0.952139 2.855945 0.375461
O  2.587879 -1.533761 0.428233
N  0.582114 0.527032 0.530033
N  4.189045 -1.905391 -1.220451
C  -2.745357 -1.099217 0.008736
C  -3.59424 0.023342 -0.242679
C  -0.812373 0.421445 0.266023
C  -1.373114 -0.884401 0.258263
C  -3.020297 1.317224 -0.230866
C  -1.64928 1.538676 0.018131
C  -3.306178 -2.510577 0.009371
C  -5.076378 -0.162446 -0.514626
C  1.364709 1.668988 0.55601
C  2.843071 1.387657 0.859754
C  3.44506 -1.100569 -0.39492
H  -0.722135 -1.747363 0.451416
H  -3.665555 2.183283 -0.422706
H  -1.22546 2.544125 0.02258
H  -2.520986 -3.255852 0.222323
H  -4.101693 -2.630531 0.770038
H  -3.760778 -2.767368 -0.967093
H  -5.590935 -0.655121 0.333496
H  -5.571799 0.80765 -0.689827
H  -5.254207 -0.797549 -1.404473
H  1.097542 -0.360522 0.661869
H  3.339537 2.337201 1.104661
H  2.974218 0.657889 1.676215
H  4.903613 -1.529033 -1.841653
H  4.016798 -2.910466 -1.202566
