program: Gaussian 09
title: 000224678
version: EM64L-G09RevD.01
frameworkgroup: C1[X(C12H16ClNOS)]
method: RPBEPBE
basis: SDD
operation: Freq
keyword: #p
keyword: freq=noraman
keyword: PBEPBE/SDD
title: #p freq=noraman PBEPBE/SDD
converged: YES YES NO NO
title: Mulliken charges:
elementType: Cl S O N C C C C C C C C C C C C H H H H H H H H H H H H H H H H
charge: -0.065786 0.184660 -0.315765 -0.119248 -0.027845 -0.675969 -0.681299 0.367742 -0.659761 -0.883608 -0.147756 -0.246971 -0.179609 -0.205643 -0.240019 -0.091726 0.200025 0.209421 0.266792 0.212828 0.208486 0.210214 0.270572 0.245895 0.235153 0.256402 0.317333 0.280769 0.248588 0.310960 0.256615 0.258550
chargesum: 0.00000
title: Mulliken charges with hydrogens summed into heavy atoms:
elementType: Cl S O N C C C C C C C C C C C C
charge: -0.065786 0.184660 -0.315765 -0.119248 0.172180 0.013072 0.007972 0.367742 0.077689 -0.285505 -0.147756 0.001617 0.131351 0.050972 0.018531 -0.091726
polarizability: 2.40959843e+02 -1.88312022e+01 1.59124702e+02 7.48500110e+00 1.31078774e+01 1.06654245e+02
1716.lowfreq: -17.3719 -11.3788 -5.0462 -0.0014 -0.0013 0.0007 6.9472 36.8098 41.6981
frequency: -12.8242 36.6398 41.6291 53.8476 69.8720 89.8837 109.6423 132.7054 154.7749 189.7515 214.9024 224.7539 239.7659 251.4817 284.2354 302.9171 308.5616 355.3065 392.9373 409.1071 435.0440 450.9077 461.9626 482.4363 494.5833 555.8441 618.4388 626.8807 678.3680 693.1256 710.2806 740.9708 813.8995 842.8200 854.9655 898.3134 919.5488 937.9691 942.9308 944.8005 983.7463 988.1301 1064.6372 1074.1719 1085.6715 1109.3462 1113.9890 1124.5061 1144.7160 1152.2699 1181.5817 1197.1879 1206.4085 1240.1938 1301.3460 1316.9526 1337.8807 1357.1482 1370.3685 1385.3660 1388.6777 1411.2625 1439.3047 1454.1503 1457.1782 1465.0416 1469.3331 1474.0155 1481.0544 1487.1719 1497.9229 1575.0282 1578.8864 1581.3972 2971.8672 2986.4930 2988.9037 2999.6289 3042.4799 3045.8580 3076.6315 3082.4019 3111.8334 3116.3825 3117.6410 3125.8573 3133.8683 3142.1742 3168.3703 3172.5136
redmass: 3.3176 3.2680 3.4760 4.0129 2.3581 7.5470 2.1432 4.3294 6.5105 1.5457 1.5178 1.9934 1.6530 4.9040 7.6808 2.6004 7.5655 5.2924 2.6308 2.9893 3.4009 2.7043 3.0465 3.3384 7.5951 4.7334 6.6944 6.2780 3.0786 4.1147 7.3133 6.6842 1.3640 1.3007 2.6643 2.0174 1.1670 1.8164 1.6975 1.3323 1.3466 4.9836 6.4764 2.0017 1.4959 1.3393 1.4047 1.3607 2.2827 2.6273 1.7642 1.1625 2.8626 1.2064 1.2757 1.3683 1.8510 5.6834 1.2140 1.2416 3.1432 1.4949 1.2011 1.0466 1.3738 2.0014 1.0593 1.0701 1.0514 1.0901 1.0619 6.5599 5.7594 5.5071 1.0395 1.0368 1.0440 1.0754 1.1018 1.0603 1.1000 1.0993 1.1000 1.0942 1.0992 1.1032 1.0952 1.0893 1.0942 1.0965
irintensity: 1.9602 2.1632 0.6357 0.2574 0.5740 0.1210 2.5050 2.1752 2.5193 0.1745 0.5640 6.0761 1.9257 2.4432 0.6560 2.7305 0.4293 1.1517 1.8112 0.1459 7.1897 6.0972 3.8213 30.1706 30.8364 8.5259 8.6188 14.5530 14.5001 0.1424 4.2905 1.8871 44.5086 32.5705 1.0735 0.0769 5.2309 1.0151 0.3907 0.1308 3.1823 71.6800 12.7970 64.4878 105.6471 1.0955 17.2237 10.1132 9.4328 6.4403 2.1492 2.0326 14.7638 3.3006 1.2474 3.2915 141.7370 3.2868 29.9575 36.9100 6.1214 16.7638 25.3442 1.5229 15.4144 151.3031 24.4497 6.9532 4.5475 35.8940 8.2355 70.5251 2.7020 148.6820 44.7520 34.5185 17.5416 48.9784 27.9966 12.1063 19.3667 56.6890 1.2004 45.7897 14.9525 10.4351 19.3046 3.4290 3.3933 5.2167
temp: 298.150 k
press: 1.00000 atm
elementType: 17 16 8 7 6 6 6 6 6 6 6 6 6 6 6 6 1 1 1 1 1 1 1 1 1 1 1 1 1 1 1 1
symmnumber: 1
zpe: 668388.0 jmol-1
zpe.correction: 0.254576 hartree
zpe.thermalcorrener: 0.271487 hartree
zpe.thermalcorrenthalpy: 0.272432 hartree
zpe.thermalcorrgfe: 0.208769 hartree
zpe.sumelectzpe: -1453.761806 hartree
zpe.sumelectthermal: -1453.744894 hartree
zpe.sumelectthermalent: -1453.743950 hartree
zpe.sumelectthermalfe: -1453.807612 hartree
dipole: -4.7062 2.7316 0.8012
dipole: 5.5002
quadrupole: -102.9429 -108.5493 -111.1555
quadrupole: 0.1179 -1.9262 -0.9610
quadrupole: 4.6064 -1.0001 -3.6063 0.1179 -1.9262 -0.9610
hfenergy: -1454.0163812 hartree
pointgroup: C01[X(C12H16Cl1N1O1S1)]
dipole: 1.8368874 0.8719999 0.7403464 debye
polarizability: 232.262423|-1.3581684|150.2106615|39.0963053|21.3375665|124.2657059 unknown
InChI: InChI=1S/C12H16ClNOS/c1-9(2)14(3)12(15)8-16-11-6-4-10(13)5-7-11/h4-7,9H,8H2,1-3H3
charge 0 multiplicity 1
32 atoms
Cl -5.424684 -0.523042 -1.68008
S  -0.110997 1.585346 1.349345
O  1.321128 -1.706267 0.391417
N  2.940771 -0.066459 0.745489
C  3.884115 -0.688468 -0.250933
C  3.303687 -0.651634 -1.683676
C  4.32112 -2.106719 0.180344
C  1.705337 -0.63752 0.981288
C  3.399614 1.209255 1.324858
C  0.763247 0.024001 1.994537
C  -1.591296 0.896247 0.495467
C  -2.688884 1.780156 0.343167
C  -1.657793 -0.419961 -0.020907
C  -3.856267 1.354556 -0.32731
C  -2.833516 -0.854379 -0.67671
C  -3.911771 0.037594 -0.824086
H  4.779249 -0.035981 -0.228006
H  4.063627 -1.010784 -2.401473
H  2.415531 -1.299167 -1.754011
H  3.016481 0.376378 -1.970068
H  4.749863 -2.09613 1.198989
H  5.093724 -2.482329 -0.515324
H  3.462445 -2.795776 0.163851
H  3.553198 1.961368 0.527512
H  4.357672 1.065647 1.859999
H  2.66783 1.625265 2.030106
H  -0.015882 -0.708304 2.252513
H  1.266979 0.347355 2.919559
H  -2.644595 2.794514 0.754053
H  -0.808435 -1.108345 0.063356
H  -4.705835 2.032808 -0.446792
H  -2.89316 -1.871324 -1.075176
