program: Gaussian 09
title: 000224694
version: EM64L-G09RevD.01
frameworkgroup: C1[X(C17H22N2O7)]
method: RPBEPBE
basis: SDD
operation: Freq
keyword: #p
keyword: freq=noraman
keyword: PBEPBE/SDD
title: #p freq=noraman PBEPBE/SDD
converged: YES YES NO NO
title: Mulliken charges:
elementType: O O O O O O O N N C C C C C C C C C C C C C C C C C H H H H H H H H H H H H H H H H H H H H H H
charge: -0.268568 -0.252996 -0.301908 -0.266085 -0.209832 -0.230409 -0.318627 -0.366541 -0.356765 -0.293776 0.246254 -0.525881 0.285716 0.249031 0.450502 -0.443840 -0.261396 -0.261630 0.339704 -0.359342 -0.422963 -0.225197 -0.210840 -0.657365 -0.664688 -0.248815 0.320125 0.383966 0.257661 0.257438 0.335770 0.252901 0.241939 0.224301 0.236480 0.245294 0.233283 0.252496 0.237027 0.232408 0.231328 0.255497 0.228515 0.215932 0.235477 0.250936 0.212452 0.235027
chargesum: 0.00000
title: Mulliken charges with hydrogens summed into heavy atoms:
elementType: O O O O O O O N N C C C C C C C C C C C C C C C C C
charge: -0.268568 -0.252996 -0.301908 -0.266085 -0.209832 -0.230409 -0.318627 0.017425 -0.020995 0.026350 0.246254 -0.010782 0.285716 0.249031 0.450502 0.051000 0.199386 0.216947 0.339704 -0.106846 -0.185936 0.007212 0.020488 0.042579 0.034177 -0.013787
polarizability: 2.18473022e+02 -1.29046462e+01 2.32066058e+02 -7.94059696e+00 -1.28743359e+01 1.88160629e+02
1716.lowfreq: -16.3806 -8.0984 -4.8565 0.0007 0.0010 0.0010 5.1211 11.9327 18.8061
frequency: -14.6686 11.8089 18.6512 26.3334 28.5187 32.2236 42.5246 50.0844 56.0388 61.3133 76.3622 84.0897 92.6246 113.5833 120.5602 147.6727 160.9723 179.6791 190.2840 199.3702 219.3931 220.5766 249.6293 275.5083 296.3955 305.5921 309.2911 318.1503 374.2331 391.9788 401.5732 409.2725 428.4480 450.3130 476.6059 518.7217 544.4265 546.6345 587.0202 611.7058 616.6470 631.7143 648.4138 695.4735 702.8988 706.4721 731.8741 738.8079 747.2878 757.5578 777.4997 803.0915 804.0690 817.5235 818.8744 840.1861 857.4204 887.8559 914.9950 917.7175 938.3797 955.9185 980.0885 988.0458 989.7289 997.9620 1010.2854 1012.1279 1016.4254 1026.6573 1086.3203 1095.8071 1097.8058 1102.5273 1118.9444 1156.5156 1158.1857 1168.4968 1173.2639 1186.7585 1192.0420 1210.7841 1213.4864 1243.2681 1250.8980 1269.0075 1277.1866 1278.4740 1281.6632 1300.5359 1314.5793 1342.5211 1351.1521 1353.2510 1354.3074 1386.3013 1391.0950 1393.1734 1436.9155 1441.1242 1454.1383 1458.6330 1459.3759 1461.4581 1462.3348 1481.8934 1483.1127 1484.2889 1485.3393 1507.5223 1594.2889 1614.9215 1620.0918 1626.2819 1651.6194 1659.5704 2994.8901 2995.9463 3015.0901 3021.2321 3030.6927 3031.0972 3042.7303 3082.2999 3090.2081 3091.4295 3095.8541 3099.8615 3116.0686 3121.1434 3121.7275 3126.5949 3129.8065 3141.5168 3152.8987 3166.4704 3393.8858 3580.2541
redmass: 3.6894 4.8330 4.4749 4.2567 4.8329 5.0238 5.2073 5.1014 4.7954 5.1201 4.4408 6.2356 6.5324 3.5206 4.2922 4.4627 4.4784 3.8039 1.9269 2.2617 3.0159 1.6824 4.2810 3.7483 3.6870 3.1213 3.4650 2.9381 4.5588 5.4081 2.8341 4.1472 3.4972 3.4626 4.7786 3.7622 1.3473 4.0928 5.0609 5.0345 5.9658 4.8675 5.1340 7.6347 2.2547 4.8107 4.0012 2.3184 2.2234 2.7074 1.4985 2.3463 3.2133 1.3884 1.7787 3.4847 1.2544 4.5147 1.3816 3.2867 4.8541 4.5782 1.3909 2.1934 5.6349 1.4074 2.1817 3.0005 3.2116 2.1878 1.5636 2.2368 2.2360 4.5467 5.1212 1.6950 1.6866 6.9066 1.0557 1.2168 3.0258 2.3315 2.2852 1.6283 1.4368 1.2068 1.1238 1.1830 1.4588 1.3194 1.3372 1.2995 1.3934 1.2744 1.2810 4.9958 1.2359 1.2283 1.8440 1.1126 1.2266 1.0845 1.0892 1.0471 1.0507 1.0664 1.0581 2.2563 1.7845 1.8146 6.0983 6.0395 7.9619 9.7213 6.6339 10.1279 1.0362 1.0358 1.0575 1.0635 1.0598 1.0610 1.0830 1.1065 1.0974 1.0975 1.1031 1.1018 1.1009 1.0864 1.1059 1.1063 1.0872 1.0921 1.0960 1.1014 1.0822 1.0781
irintensity: 0.3769 0.1969 0.1118 0.0647 0.7298 0.4909 0.7500 1.0302 1.8935 5.3631 0.7129 4.1810 7.1669 0.3745 3.5746 0.1350 1.9558 2.1214 0.5815 3.2312 10.3825 4.1652 4.5697 6.6054 6.7124 18.6968 7.1577 15.7115 8.0762 7.6551 0.5548 6.8738 2.9086 14.8744 28.3460 20.6078 96.5300 40.0246 12.1288 3.8864 0.2179 6.7586 18.7938 22.9947 43.9129 0.5798 19.3028 27.0862 64.9524 15.7635 114.8697 18.6772 16.2192 1.2290 0.5086 23.9194 1.1854 7.3445 6.0349 43.7109 104.6253 21.8404 0.8229 1.3823 0.7392 3.5524 2.9784 82.8063 94.6437 6.5028 8.2192 43.0569 2.0457 78.3094 148.9264 21.7842 32.4516 200.7541 0.1613 1.7709 70.5010 301.9263 64.8083 37.6153 83.7910 2.0294 11.3912 12.6095 30.4689 25.4579 5.9611 6.9578 4.8796 0.7940 0.4858 1.6180 26.4742 28.5818 4.1964 29.1579 23.6931 17.9400 9.8318 17.5213 11.1720 11.3989 18.1075 13.8501 294.7270 283.4243 2.3514 2.1880 109.8867 129.0919 267.4054 303.0900 17.6750 13.0333 30.0542 18.2117 34.9555 11.8216 22.0052 3.1686 36.8882 26.1285 0.6748 4.8976 5.4686 3.7869 25.8230 22.7100 0.4896 16.3128 26.8880 14.6254 177.2047 47.0877
temp: 298.150 k
press: 1.00000 atm
elementType: 8 8 8 8 8 8 8 7 7 6 6 6 6 6 6 6 6 6 6 6 6 6 6 6 6 6 1 1 1 1 1 1 1 1 1 1 1 1 1 1 1 1 1 1 1 1 1 1
symmnumber: 1
zpe: 991304.2 jmol-1
zpe.correction: 0.377568 hartree
zpe.thermalcorrener: 0.404211 hartree
zpe.thermalcorrenthalpy: 0.405155 hartree
zpe.thermalcorrgfe: 0.315437 hartree
zpe.sumelectzpe: -1295.148732 hartree
zpe.sumelectthermal: -1295.122089 hartree
zpe.sumelectthermalent: -1295.121144 hartree
zpe.sumelectthermalfe: -1295.210863 hartree
dipole: 5.9886 -1.4055 3.8027
dipole: 7.2318
quadrupole: -158.7949 -138.6741 -151.7516
quadrupole: 5.6064 -20.9169 -0.4086
quadrupole: -9.0547 11.0661 -2.0114 5.6064 -20.9169 -0.4086
hfenergy: -1295.5262999 hartree
pointgroup: C01 [X(C17H22N2O7)]
dipole: -2.2970514 0.3516052 -1.6416671 debye
polarizability: 217.524923|14.3686481|205.8854293|0.4200414|25.6078474|215.2893564 unknown
InChI: InChI=1S/C17H22N2O7/c1-3-24-15(21)14(16(22)25-4-2)19-13(20)10-18-17(23)26-11-12-8-6-5-7-9-12/h5-9,14,18-19H,3-4,10-11H2,1-2H3
charge 0 multiplicity 1
48 atoms
O  3.334429 0.300425 -1.126761
O  0.455384 -0.968541 0.465264
O  -2.60933 2.42826 0.620655
O  2.036922 1.628895 3.439976
O  4.963173 0.327794 0.551484
O  2.339107 -2.33904 0.621384
O  -0.467885 2.500226 -0.385926
N  1.753336 1.275714 1.143358
N  -0.785221 2.875062 1.901842
C  2.554361 0.056217 1.125481
C  1.533728 1.961031 2.325257
C  0.622183 3.201073 2.176631
C  3.774698 0.226481 0.192495
C  1.791484 -1.217318 0.715263
C  -3.572647 0.560798 -0.712775
C  -3.218168 2.036486 -0.680539
C  4.386927 0.464708 -2.18077
C  -0.359856 -2.133718 -0.017367
C  -1.214515 2.584818 0.631422
C  -4.102169 -0.088046 0.431528
C  -3.432247 -0.16961 -1.918156
C  -4.488678 -1.445124 0.367867
C  -3.830952 -1.524676 -1.986755
C  4.953167 -0.898373 -2.585057
C  -0.131166 -2.364194 -1.51279
C  -4.360162 -2.166295 -0.84344
H  2.948647 -0.093969 2.147336
H  1.227595 1.550494 0.299136
H  1.000418 3.841112 1.358857
H  0.678938 3.75716 3.124657
H  -1.460485 2.831162 2.665031
H  -2.521337 2.302901 -1.494151
H  -4.121646 2.668317 -0.743234
H  3.848682 0.957366 -3.005831
H  5.174126 1.13034 -1.784999
H  -1.393948 -1.828403 0.203201
H  -0.08011 -3.020653 0.578282
H  -4.199437 0.471533 1.368125
H  -3.009754 0.319887 -2.804162
H  -4.894813 -1.938254 1.258091
H  -3.723204 -2.077575 -2.926616
H  5.486755 -1.368327 -1.742324
H  4.148726 -1.576412 -2.917894
H  5.667712 -0.770646 -3.419371
H  -0.351714 -1.447265 -2.085018
H  0.908297 -2.674769 -1.709503
H  -0.808071 -3.163255 -1.867182
H  -4.668778 -3.216396 -0.894197
