program: Gaussian 09
title: 000019111
version: EM64L-G09RevD.01
frameworkgroup: C1[X(C10H9NO2)]
method: RPBEPBE
basis: SDD
operation: Freq
keyword: #p
keyword: freq=noraman
keyword: PBEPBE/SDD
title: #p freq=noraman PBEPBE/SDD
converged: YES YES NO NO
title: Mulliken charges:
elementType: O O N C C C C C C C C C C H H H H H H H H H
charge: -0.290079 -0.296880 -0.613726 0.478023 -0.303208 -0.376256 -0.399811 -0.221620 -0.230723 -0.236536 0.235174 0.313307 -0.500572 0.275782 0.247598 0.268703 0.226886 0.229191 0.229743 0.340912 0.341640 0.282451
chargesum: 0.00000
title: Mulliken charges with hydrogens summed into heavy atoms:
elementType: O O N C C C C C C C C C C
charge: -0.290079 -0.296880 0.068826 0.478023 -0.027426 -0.128658 -0.131107 0.005266 -0.001532 -0.006793 0.235174 0.313307 -0.218121
polarizability: 1.30195326e+02 5.92390251e+00 1.34986994e+02 -6.44092883e+00 1.29566733e+01 8.06962280e+01
1716.lowfreq: -13.1092 -7.6289 -0.0007 0.0003 0.0005 1.5317 28.4584 50.0738 61.0363
frequency: 28.1725 50.0437 61.0320 103.3001 123.5216 180.8424 230.1951 290.6802 312.4280 395.1698 403.8367 408.5179 498.1387 503.4413 519.5580 555.2343 599.6634 615.6533 629.6584 642.8440 668.2681 698.0729 704.1134 762.3088 821.9434 834.7588 858.6679 926.8682 937.0226 982.6154 989.4056 999.7863 1005.8038 1029.7842 1059.9526 1087.2584 1173.6782 1191.2052 1199.3887 1267.8057 1281.5277 1325.9916 1343.8528 1388.1393 1445.1484 1483.4268 1586.8093 1595.6825 1613.0518 1680.7848 2150.0131 3005.4108 3124.7419 3132.0872 3142.1052 3151.7822 3165.4516 3428.4673 3556.7240 3714.7906
redmass: 4.5501 6.0449 5.1662 4.5815 4.5496 5.5418 6.2929 5.1754 4.8685 4.2899 2.8447 5.9973 1.1794 4.2217 1.0875 3.7095 6.4187 6.2347 3.0391 1.5761 1.2719 5.4567 2.1711 1.9815 5.1137 4.1188 1.2499 6.5563 1.5513 1.4863 4.4318 1.3658 3.7710 2.1327 2.0092 1.6160 1.0563 1.1322 2.1666 1.3339 1.6589 2.9215 1.3207 6.8389 2.1738 2.2491 1.2319 5.8587 5.9563 7.0184 6.0415 1.0828 1.0848 1.0881 1.0925 1.0966 1.1016 1.1604 1.0445 1.1059
irintensity: 0.0687 0.6728 10.4145 1.7758 3.8015 3.3495 9.9323 5.4390 3.6994 1.9160 0.3130 0.7067 216.7785 28.4147 71.0747 31.1970 2.7705 0.2227 7.2266 73.3233 54.6903 31.8663 64.3955 70.8450 21.7256 3.2601 0.2588 236.6033 31.6841 0.7298 8.5704 5.7583 63.1261 8.8055 2.1683 5.7555 0.2996 8.6841 22.4449 106.8480 17.8424 358.3322 6.0661 0.8898 13.3504 10.1028 92.8743 2.8321 0.1772 347.3357 0.4773 15.6584 0.1260 2.8151 10.8071 26.2135 24.4374 67.4762 72.2844 51.0422
temp: 298.150 k
press: 1.00000 atm
elementType: 8 8 7 6 6 6 6 6 6 6 6 6 6 1 1 1 1 1 1 1 1 1
symmnumber: 1
zpe: 434643.0 jmol-1
zpe.correction: 0.165547 hartree
zpe.thermalcorrener: 0.177736 hartree
zpe.thermalcorrenthalpy: 0.178680 hartree
zpe.thermalcorrgfe: 0.125778 hartree
zpe.sumelectzpe: -590.684156 hartree
zpe.sumelectthermal: -590.671967 hartree
zpe.sumelectthermalent: -590.671023 hartree
zpe.sumelectthermalfe: -590.723924 hartree
dipole: 0.1190 0.0659 2.3827
dipole: 2.3865
quadrupole: -63.6341 -65.9503 -74.5348
quadrupole: -1.1343 6.6482 -2.3332
quadrupole: 4.4056 2.0895 -6.4951 -1.1343 6.6482 -2.3332
hfenergy: -590.8497025 hartree
pointgroup: C01 [X(C10H9N1O2)]
dipole: -0.0920625 -0.705496 -0.6126981 debye
dipolederiv: -1.0681706 -0.3751794 0.3672843 -0.5659571 -0.7780396 0.4127705 0.5430196 0.4819577 -0.9339282 -0.5745923 -0.1845873 0.0581579 -0.2131694 -0.6361258 -0.1545186 0.0864675 -0.1504071 -1.0022104 -1.0223772 -0.3052713 -0.0406786 -0.426122 -1.1052437 0.0277239 -0.0719924 -0.0202126 -0.3144543 0.0043062 -0.0578574 0.0350189 0.0998034 -0.1664703 0.1010642 -0.0064654 0.0229073 -0.0386581 1.0124675 0.083174 -0.0804759 0.2094684 0.8728134 -0.4609476 0.1178923 -0.1438361 0.3361332 -0.0908337 -0.0214976 0.0597572 -0.027867 -0.111495 -0.0442653 -0.0170857 -0.0179294 0.0215473 -0.0579937 -0.0192565 -0.0989779 -0.0073481 -0.1393433 0.0020097 -0.0013889 -0.0318734 0.0016165 -0.0299203 -0.0401441 -0.1188417 -0.0281159 -0.1358431 0.015118 -0.1264155 0.016192 0.0607999 -0.0922522 -0.0241208 0.0741805 -0.0461344 -0.1276237 -0.0602555 0.0937063 -0.0367194 0.0925021 0.0666235 -0.0906232 0.0043908 -0.079424 -0.1219312 -0.0124075 0.0008065 -0.0052388 -0.0443558 -0.1702189 0.029924 -0.0283927 -0.076386 -0.0518518 -0.0411775 0.0204335 -0.0244654 -0.0057172 1.1998125 0.8630855 -0.2802497 1.0090283 1.3711784 0.0421924 -0.6028437 -0.1424577 1.6083146 -0.3189735 0.0399362 -0.0211919 0.0804511 -0.3827328 0.0670296 -0.0614764 0.1119792 -0.3612831 0.0437169 0.0292584 -0.0149169 -0.0156521 0.0229415 0.0517278 -0.04555 -0.105707 0.043453 0.1005743 0.0181854 -0.0546642 0.0161663 0.1343747 0.0431093 -0.0592728 0.0446522 -0.0350672 0.090868 0.0401367 0.0891735 0.0403046 0.1370069 -0.0064784 0.0719595 -0.0065894 0.0215422 0.010141 0.0422835 0.0916406 0.0434337 0.1408673 -0.0087961 0.1111359 -0.0169697 -0.0539312 0.0474996 0.0453776 -0.0678974 0.047535 0.136028 0.0468315 -0.0833733 0.0489328 -0.0811164 -0.1042696 0.0945378 -0.0154446 0.0981445 0.1230142 0.013641 -0.0132988 0.0131793 0.089909 0.3461763 -0.0807734 0.0194695 -0.0640296 0.2883548 -0.0245928 0.0509204 0.0038587 0.1760786 0.3413963 -0.082765 0.0247947 -0.0890373 0.2809474 -0.0202753 -0.0052487 -0.0526229 0.1837829 0.2660199 -0.0038234 -0.0021363 -0.0050923 0.2491737 0.0104966 -0.0019299 0.0113694 0.2350425 unknown
polarizability: 131.3135411|-9.7919684|89.3839491|0.8997987|-23.2021722|125.1810586 unknown
InChI: InChI=1S/C10H9NO2/c1-2-9(13-10(11)12)8-6-4-3-5-7-8/h1,3-7,9H,11H2
charge 0 multiplicity 1
22 atoms
O  -1.635733 -0.421673 -0.282849
O  -2.000076 -0.305218 2.054575
N  -2.988038 -1.954754 0.706902
C  0.733998 0.282369 -0.084449
C  -0.707833 0.774893 -0.160869
C  1.525324 0.110606 -1.246131
C  1.275438 -0.040379 1.185727
C  2.842788 -0.385893 -1.139913
C  2.593447 -0.53568 1.290377
C  3.380091 -0.710564 0.127779
C  -1.007662 1.647093 -1.301296
C  -2.197555 -0.853894 0.939836
C  -1.260678 2.402171 -2.240249
H  -0.979433 1.27408 0.790165
H  1.110634 0.372952 -2.22581
H  0.657488 0.087308 2.082251
H  3.451582 -0.515708 -2.041666
H  3.0066 -0.781804 2.274693
H  4.404116 -1.092359 0.208912
H  -3.086122 -2.327182 -0.234482
H  -3.471251 -2.383472 1.491024
H  -1.482626 3.064409 -3.056928
