program: Gaussian 09
title: 000224684
version: EM64L-G09RevD.01
frameworkgroup: C1[X(C16H26N2O)]
method: RPBEPBE
basis: SDD
operation: Freq
keyword: #p
keyword: freq=noraman
keyword: PBEPBE/SDD
title: #p freq=noraman PBEPBE/SDD
converged: YES YES NO NO
title: Mulliken charges:
elementType: O N N C C C C C C C C C C C C C C C C H H H H H H H H H H H H H H H H H H H H H H H H H H
charge: -0.432115 -0.169028 -0.117383 -0.475177 -0.372613 -0.431829 -0.075377 0.239567 -0.542673 0.358920 -0.401444 -0.372883 -0.425944 -0.320676 -0.316534 -0.259053 -0.281489 -0.689885 -0.677222 0.209875 0.249986 0.200890 0.235956 0.252547 0.202188 0.227578 0.212759 0.224262 0.224355 0.184559 0.256375 0.222823 0.216986 0.191027 0.206269 0.188038 0.319388 0.211247 0.219785 0.240395 0.206921 0.213987 0.229270 0.203179 0.212191
chargesum: 0.00000
title: Mulliken charges with hydrogens summed into heavy atoms:
elementType: O N N C C C C C C C C C C C C C C C C
charge: -0.112728 -0.169028 -0.117383 -0.015316 0.064233 -0.002063 0.177169 0.239567 -0.105652 0.358920 0.007470 -0.116508 -0.203121 0.087337 0.077774 -0.047806 -0.061703 -0.028582 -0.032581
polarizability: 2.19095919e+02 -3.83052252e+00 2.18949043e+02 4.65163242e+00 -6.97731779e+00 1.35047279e+02
1716.lowfreq: -17.3097 -12.9007 -11.3058 -0.0007 0.0004 0.0006 12.3227 28.8177 38.4664
frequency: 8.3332 28.3589 38.1002 47.7983 64.3189 79.0999 84.3949 89.7935 143.9273 147.5976 189.7210 197.9867 209.7383 259.9267 267.7562 288.9777 303.0941 308.1712 320.0193 339.7794 377.2921 402.5015 404.1637 445.0524 457.5391 463.6562 486.0495 496.8205 511.1320 540.0833 578.7564 612.6611 695.7101 727.8494 746.3280 746.9793 793.7041 794.8095 799.7962 815.7977 850.9405 871.7908 878.9954 885.1476 915.6804 927.1778 931.5903 964.7313 980.0988 988.2379 1020.0103 1042.4683 1055.1485 1062.8985 1071.2769 1074.1766 1077.7270 1085.4439 1094.9375 1116.9742 1122.8290 1149.6687 1162.4378 1173.4787 1183.2118 1196.4487 1199.9501 1216.9003 1226.6898 1250.2561 1257.5069 1272.7023 1286.4025 1290.1983 1296.5049 1303.4172 1327.6296 1340.9133 1349.6134 1356.0555 1359.5318 1363.5777 1369.9519 1373.4740 1381.9571 1386.2673 1393.2557 1409.0123 1450.8219 1459.4777 1460.1410 1466.0846 1467.3505 1470.7217 1474.8533 1477.9917 1481.3104 1484.8091 1485.9709 1490.8898 1512.3416 1577.6996 1617.9936 2857.2352 2865.1357 2900.5307 2907.5321 2955.1272 2956.2516 2980.7475 2988.1610 2999.0358 3002.5701 3028.4149 3028.8018 3035.8395 3040.1284 3042.2889 3063.2089 3069.9860 3074.3594 3079.2076 3088.2632 3094.5209 3106.6580 3115.2300 3139.0851 3156.5957 3529.0831
redmass: 3.5098 3.6137 4.3978 3.2454 3.4411 2.1493 1.9923 3.1413 2.3357 3.4266 1.7000 3.1787 1.5723 1.9912 2.0034 2.5498 1.6634 1.7189 2.1891 2.7309 2.7845 3.1647 3.4663 2.8120 3.2920 2.7316 3.4805 2.7332 2.5525 3.7724 4.0883 2.5080 4.4420 3.0823 2.3618 1.4522 1.9657 1.4170 1.3528 2.6051 1.3705 1.8082 1.6461 2.3167 2.1042 2.1518 1.4296 1.2853 2.2112 2.2884 2.3704 2.4915 2.7214 2.1498 2.2500 1.9332 1.7760 2.2011 2.5111 1.9201 2.0307 1.4811 1.4347 1.2482 1.2996 1.4604 2.2105 2.1410 2.0515 1.4831 1.3370 1.2406 1.2065 1.2797 1.4953 1.2271 1.4030 1.5486 1.4239 1.3487 1.3354 1.2880 1.2833 1.3806 5.6221 1.2335 1.2332 1.7372 1.9224 1.2138 1.0580 1.0562 1.1145 1.0549 1.0970 1.0589 1.1129 1.1266 1.1030 1.0798 2.4857 6.6733 6.2425 1.0722 1.0713 1.0673 1.0702 1.0664 1.0665 1.0360 1.0360 1.0618 1.0908 1.0904 1.0881 1.0925 1.0878 1.0935 1.1042 1.0883 1.0976 1.0979 1.1004 1.0999 1.0870 1.0881 1.0929 1.0995 1.0658
irintensity: 0.0702 0.3908 0.0929 0.4081 1.3559 0.1012 1.0079 5.1879 0.1052 0.7036 1.2354 1.7297 1.3547 0.4981 8.8730 5.9176 56.2970 54.3995 11.6442 7.4762 15.6352 17.8369 5.8888 4.6987 6.1679 0.6776 2.9709 18.8500 5.7327 0.1835 5.5925 1.9415 0.9318 2.9020 10.8283 87.1479 13.7796 3.1856 8.3232 5.1165 2.3439 7.3331 5.4935 13.3354 1.8292 2.0679 2.7646 0.4988 87.4117 15.2253 17.6712 8.0123 37.0599 24.3449 21.5763 5.5936 2.4565 3.1929 2.8088 4.5155 11.6242 6.9753 14.8564 2.6591 10.1669 13.7726 27.4660 6.7810 41.9361 18.9276 16.8877 43.3822 18.0713 35.7672 10.4655 1.6284 37.9005 24.8688 6.4466 13.7860 3.0599 15.5938 20.6829 4.6833 11.2394 19.7448 22.9280 0.6558 20.1639 6.2254 2.4927 4.2023 7.8620 3.5029 31.2868 2.5371 1.0216 16.3178 1.7861 11.8552 126.3783 10.1379 94.0780 29.1713 183.3456 117.7205 92.9755 52.2405 52.7397 24.0475 26.8383 24.8241 27.4276 26.3512 14.9664 44.5130 8.1800 19.1070 48.9531 15.7169 56.0827 59.5154 39.2790 50.8447 11.4062 27.4111 7.5325 31.5400 4.1578
temp: 298.150 k
press: 1.00000 atm
elementType: 8 7 7 6 6 6 6 6 6 6 6 6 6 6 6 6 6 6 6 1 1 1 1 1 1 1 1 1 1 1 1 1 1 1 1 1 1 1 1 1 1 1 1 1 1
symmnumber: 1
zpe: 1032923.5 jmol-1
zpe.correction: 0.393420 hartree
zpe.thermalcorrener: 0.413669 hartree
zpe.thermalcorrenthalpy: 0.414613 hartree
zpe.thermalcorrgfe: 0.342201 hartree
zpe.sumelectzpe: -808.515704 hartree
zpe.sumelectthermal: -808.495454 hartree
zpe.sumelectthermalent: -808.494510 hartree
zpe.sumelectthermalfe: -808.566923 hartree
dipole: 2.5098 -2.1607 1.2109
dipole: 3.5262
quadrupole: -104.5490 -111.1660 -122.6161
quadrupole: 3.7854 1.3210 -7.2381
quadrupole: 8.2280 1.6110 -9.8391 3.7854 1.3210 -7.2381
hfenergy: -808.9091234 hartree
pointgroup: C01 [X(C16H26N2O1)]
dipole: 1.1102745 0.8027451 -0.2181035 debye
polarizability: 220.0171089|3.6557932|217.580472|4.4107581|9.3868959|135.4946603 unknown
InChI: InChI=1S/C16H26N2O/c1-3-17(4-2)12-15(19)13-18-11-7-9-14-8-5-6-10-16(14)18/h5-6,8,10,15,19H,3-4,7,9,11-13H2,1-2H3
charge 0 multiplicity 1
45 atoms
O  1.092408 2.469998 1.84554
N  -0.853502 1.281682 -0.348545
N  3.073576 -0.374522 0.308769
C  0.601219 1.44765 -0.38792
C  -1.659503 2.501983 -0.11624
C  -3.058056 2.174806 0.435215
C  1.30602 1.283507 0.982275
C  -1.442934 0.013696 -0.502097
C  -3.742999 1.125469 -0.46656
C  -2.872564 -0.117888 -0.575747
C  2.819031 0.996651 0.825448
C  -0.645071 -1.169825 -0.595272
C  -3.443384 -1.396786 -0.735447
C  3.085591 -1.379611 1.413061
C  4.282377 -0.458187 -0.55873
C  -1.246671 -2.432657 -0.774685
C  -2.651244 -2.563614 -0.847392
C  2.804578 -2.817968 0.940464
C  4.065135 0.14797 -1.957952
H  0.830841 2.461446 -0.78024
H  1.047775 0.723241 -1.092649
H  -1.762298 3.076617 -1.065415
H  -1.114737 3.136697 0.606835
H  0.820735 0.468752 1.544578
H  -3.651452 3.106862 0.48255
H  -2.965711 1.779876 1.464294
H  -3.910265 1.570663 -1.470206
H  -4.739598 0.857111 -0.069796
H  3.308622 1.173161 1.81292
H  3.249876 1.732818 0.116827
H  0.445805 -1.112008 -0.518965
H  -4.537777 -1.476431 -0.778052
H  2.301446 -1.089663 2.136624
H  4.055884 -1.346052 1.970644
H  4.533469 -1.5271 -0.678196
H  5.167165 0.022182 -0.068831
H  1.525836 3.250476 1.411584
H  -0.607247 -3.321159 -0.848758
H  -3.118449 -3.545169 -0.978633
H  1.819292 -2.874674 0.446501
H  3.567678 -3.18249 0.229387
H  2.800595 -3.506691 1.805615
H  3.227972 -0.360399 -2.467811
H  3.832746 1.227822 -1.912982
H  4.976591 0.030058 -2.572906
