program: Gaussian 09
title: 000224668
version: EM64L-G09RevD.01
frameworkgroup: C1[X(C10H12N2O2S)]
method: RPBEPBE
basis: SDD
operation: Freq
keyword: #p
keyword: freq=noraman
keyword: PBEPBE/SDD
title: #p freq=noraman PBEPBE/SDD
converged: YES YES NO NO
title: Mulliken charges:
elementType: S O O N N C C C C C C C C C C H H H H H H H H H H H H
charge: 0.178187 -0.258010 -0.260810 -0.441833 -0.573309 0.474751 0.450781 -0.448891 -0.350437 -0.368426 -0.383552 0.252541 -0.810732 -0.818567 0.023320 0.234384 0.303739 0.227825 0.228041 0.364898 0.224960 0.221345 0.234156 0.301380 0.300589 0.345060 0.348610
chargesum: 0.00000
title: Mulliken charges with hydrogens summed into heavy atoms:
elementType: S O O N N C C C C C C C C C C
charge: 0.178187 -0.258010 -0.260810 -0.076934 0.120361 0.474751 0.450781 -0.214506 -0.046698 -0.140601 -0.155510 0.252541 -0.130272 -0.216598 0.023320
polarizability: 2.13116020e+02 8.72189070e+00 1.58845846e+02 -2.37672153e+00 -7.76542763e+00 8.55130769e+01
1716.lowfreq: -36.7280 -6.2115 -0.0023 -0.0013 -0.0008 3.9862 7.9060 36.7417 41.7540
frequency: -36.5741 36.7281 41.6997 62.0032 80.5928 87.3352 142.8362 154.0465 194.7777 209.9239 292.0056 322.7462 348.7036 376.5574 392.8398 411.0522 443.0416 467.3254 477.5607 517.9244 547.5112 560.0727 613.9270 633.0320 644.3870 654.0748 719.5007 735.8836 767.6562 815.7748 828.6261 853.6945 873.3299 901.1316 936.2693 951.4786 987.0477 988.2311 1009.9082 1046.4363 1060.9406 1126.7228 1144.6833 1191.4191 1222.6518 1233.5791 1245.1062 1274.7722 1282.1207 1315.0968 1371.4055 1396.3230 1413.0539 1416.3716 1470.7059 1472.7246 1510.6237 1540.1696 1591.2409 1599.3928 1622.5709 1628.1923 1653.5844 2971.2551 3044.0716 3051.6903 3081.0595 3113.1641 3123.9212 3137.5574 3143.9895 3190.1397 3315.1837 3521.4421 3673.2551
redmass: 1.0161 4.1402 5.5611 6.3240 6.8411 6.2037 6.4190 5.5321 5.5993 4.6949 4.2817 3.1917 4.3473 3.5307 3.9928 2.9831 7.0420 2.2321 1.6789 2.7920 1.2698 5.4674 3.7477 6.9919 4.0849 5.2801 3.0862 5.6641 4.6542 1.4937 3.0220 1.3223 1.2075 2.2478 5.6028 1.3508 1.4113 1.3425 2.8784 1.5448 2.0344 1.2916 1.2769 1.1159 2.6581 2.6929 1.2462 2.8290 2.3480 1.4506 5.2327 1.2255 2.2333 1.3647 1.1017 1.0534 2.6935 2.3736 1.7746 4.5452 2.4238 6.0985 3.2802 1.0387 1.0606 1.0948 1.0996 1.0872 1.0908 1.0969 1.1045 1.0945 1.0816 1.0449 1.1051
irintensity: 0.6675 3.2579 1.2016 2.4308 4.3864 5.4776 8.5939 9.5742 8.4139 2.8027 2.9639 4.7000 0.5700 2.0176 5.3047 0.1839 0.8188 14.9974 2.1837 29.0610 266.0239 3.1421 52.0457 0.5956 60.7783 22.6335 1.5096 4.1988 3.7733 3.0244 14.6630 47.3641 118.1094 2.7842 0.7646 13.8926 0.9161 4.0936 1.4333 20.1773 7.3743 20.3703 23.0675 0.6672 0.5166 9.7714 23.9681 180.0167 64.5055 19.7471 41.3667 5.5858 28.2845 17.3558 25.9317 12.1180 75.2506 363.8521 60.7488 137.9266 307.5102 2.7210 219.3739 48.8745 6.2062 24.9440 19.0127 16.3751 27.6442 14.4544 0.0255 3.7542 295.3375 83.5574 44.6742
temp: 298.150 k
press: 1.00000 atm
elementType: 16 8 8 7 7 6 6 6 6 6 6 6 6 6 6 1 1 1 1 1 1 1 1 1 1 1 1
symmnumber: 1
zpe: 545962.8 jmol-1
zpe.correction: 0.207946 hartree
zpe.thermalcorrener: 0.222370 hartree
zpe.thermalcorrenthalpy: 0.223314 hartree
zpe.thermalcorrgfe: 0.165079 hartree
zpe.sumelectzpe: -1045.217233 hartree
zpe.sumelectthermal: -1045.202810 hartree
zpe.sumelectthermalent: -1045.201866 hartree
zpe.sumelectthermalfe: -1045.260101 hartree
dipole: 3.1731 -4.6187 -0.4758
dipole: 5.6239
quadrupole: -68.9363 -93.2866 -97.4464
quadrupole: -9.1347 -3.2989 5.4520
quadrupole: 17.6201 -6.7302 -10.8899 -9.1347 -3.2989 5.4520
hfenergy: -1045.4251796 hartree
pointgroup: C01 [X(C10H12N2O2S1)]
dipole: 1.3113815 1.7133206 0.4903077 debye
polarizability: 212.1970023|-11.2341369|160.2974581|3.5167776|3.5566092|84.9804832 unknown
InChI: InChI=1S/C10H12N2O2S/c1-7-2-4-8(5-3-7)12-9(13)6-15-10(11)14/h2-5,12H,6,11H2,1H3
charge 0 multiplicity 1
27 atoms
S  3.585895 -0.831641 0.650387
O  0.526648 -2.7486 -0.264396
O  2.546989 1.470305 -0.488245
N  0.371074 -0.403255 -0.505936
N  4.189911 1.764349 1.134546
C  -1.006159 -0.159038 -0.246251
C  -3.748588 0.496125 0.249617
C  -1.446295 1.191611 -0.285908
C  -1.942867 -1.185989 0.046396
C  -2.796258 1.50788 -0.039922
C  -3.290057 -0.845148 0.289995
C  1.045779 -1.612467 -0.490894
C  -5.210731 0.836502 0.481449
C  2.542936 -1.477968 -0.80381
C  3.369717 0.996241 0.347688
H  -0.726791 1.990533 -0.505268
H  -1.605215 -2.223362 0.08251
H  -3.115427 2.556825 -0.072512
H  -4.002767 -1.6476 0.517822
H  0.965722 0.427886 -0.670663
H  -5.688491 0.118936 1.171897
H  -5.329281 1.849051 0.906672
H  -5.783545 0.809394 -0.466446
H  2.951527 -2.477445 -1.009228
H  2.73682 -0.797014 -1.649404
H  4.87254 1.351725 1.76856
H  4.107908 2.779266 1.075441
